{"text_format":"1","workbook":"xlsx","n_sheets":16,"sheets":["Contract Info","Task Order Totals","Contract Totals Details","Contract Total Overview","1-May-23 sample day","2-May-23","HCM-12 Pilot Duty Segovia","HCM-13 Driver Sample","HCM-14 Mechanic Duty Mechando","HCM-2-Pre-Use Checklist","HCM-4 Power Check","HCM-5 Trend Analysis","HCM-6 Helicopter Info","HCM-7 Crew Info","HCM-16 Contractor Eval","User Manual"],"not_rendered":{"charts":10,"images":0,"macros":1,"external_links":0,"defined_names":13,"comments":5,"pivot_tables":0},"unopened":[],"bounds":{"document_bytes":16777216,"sheet_cells":100000,"rows_first":2000,"rows_last":500,"rows_between":2000,"halvings":0,"cell_chars":16384,"cell_head_chars":4096},"cells_cut":0,"cells_raw":0,"read":"whole","date_system":"1900"}

{"sheet":"Contract Info","index":0,"n_rows":47,"n_cols":6,"rows_kept":47,"cut":false,"hidden":false,"merged":[[0,0,0,6],[1,1,1,5],[7,3,7,5],[8,3,8,5],[37,4,37,5]]}
["SuperManager v3.23 SEKI"]
[null,"Aircraft Contract Information"]
[null,"Tail Number",null,"N836TJ"]
[null,"Make and Model",null,"Airbus H-125"]
[null,"Type (1, 2 or 3)",null,3]
[null,"ARA# or contract number - Item #",null,"140D8021D0666"]
[null,"Aircraft designated base",null,"Asher Hill Helibase"]
[null,"Contractor Name",null,"Butterfly Airways, Inc."]
[null,"Contractor Address",null,"S Hwy 64 Tusama ,  Canyon, MT 86040"]
[null,"Contractor Phone Number",null,"928-638-9010"]
[null,"Contractor Email Address",null,"jerry@butterfly.com"]
[null,"Contractor Contact Name",null,"Jerry Stiller"]
[null,"Contractor Contact Phone Number",null,"480-888-6484"]
[null,"Contracting Officer Representative",null,"Marissa Terez"]
[null,"Contracting Officer Rep. Phone",null,"559-565-8888","559-269-66566"]
[null,"Contracting Officer",null,"Shavonda Jamison"]
[null,"Contracting Officer Phone",null,"202-618-7777"]
[null,"Flight Rate (hourly)",null,1375,1475,1575]
[null,"Availability",null,3095,3195,3295]
[null,"Availabilty/Hour",null,{"$f":"IF($D22>0,(D19/$D22),\"\")","v":386.875},{"$f":"IF($D22>0,(E19/$D22),\"\")","v":399.375},{"$f":"IF($D22>0,(F19/$D22),\"\")","v":411.875}]
[null,"Flight Hours Guarantee",null,0]
[null,"Hours for full aircraft availability",null,8]
[null,"# of hours afterwhich extended begins",null,9]
[null,"Fuel Truck mileage rate",null,2.4500000000000002,3.28,4.55]
[null,"Extended Pilot Rate",null,52,53,54]
[null,"Extended Driver Rate",null,37,38,39]
[null,"Extended Mechanic Rate",null,57,58,59.59]
[null,"Extended Additional Crew Rate",null,0,5,10]
[]
[null,"Burn Rate (gal/hr)",null,40]
[null,"longlines available"]
[null,"Equipped wt. (w/o lines, hook etc.)"]
[]
[null,"Default Charge Code",null,"PF.FPAMG1055.00.1"]
[null,"Default Billee Code",null,"5060"]
[null,"Aircraft Incident/Project Order #"]
[null,"Aircraft Request #"]
[null,"Maximum NPS Overtime Hourly Rate",null,46.34,"This field is used in the calculation of personnel costs in daily Aviation Personnel Cost Summaries"]
[null,"user optional fields"]
[]
[]
[]
[]
[]
[]
[]
[null,null,null,null,{"$f":"A1","v":"SuperManager v3.23 SEKI"},"2023-05-11"]

{"sheet":"Task Order Totals","index":1,"n_rows":153,"n_cols":42,"rows_kept":153,"cut":false,"hidden":false,"merged":[[1,13,1,30],[1,4,1,12],[1,37,2,41]]}
[]
[null,"Task Order",null,null,"140D8021F0399",null,null,null,null,null,null,null,null,"140D8021FP015",null,null,null,null,null,null,null,null,null,null,null,null,null,null,null,null,null,null,null,{"$f":"B2","v":"Task Order"},null,null,null,"Days or partial days spent at each unit"]
[null,"Line Item",null,null,"Avail Ln10","Fire Ln20","SAR Ln30","Fire Ln40","SAR Ln50","Fire Ln60","SAR Ln70","Fire Ln80","SAR Ln90","Ln 10","Ln 20","Ln 30","Ln 40","Ln 50","Ln 60","Ln 70","Ln 80","Ln 90","Ln 100","Ln 110","Ln 120","Ln 130","Ln 140","Ln 150","Ln 160","Ln 170","Ln 180",null,null,"Line Item"]
[null,"Project",null,null,"National SAR AV","Fire Accounts (includes severity)","Major SAR Accounts","Major SAR Accounts2",null,null,null,null,null,"MORA Aviation Base Training","MORA Climb Cost Recovery","NOCA ABANDONED MINE LANDS"," NOCA DESOLATION LOOKOUT","NOCA WILDERNESS TOILETS","NOCA FIRE PREPARED-NESS","OLYM Training A","OLYM Training B","PWR Short-haul funding FAM round 2","NOCA Mt Lakes WQ","NOCA Fish Management","MORA Carpenter Muir Toilet","MORA BC Maint A","MORA BC Maint B","MORA Maint Golden Lakes","MORA Climb Cost Recovery",null,null,null,null,"Project",null,null,null,"MORA","NOCA","OLYM","MBS","other"]
[null,"Owner Email",null,null,"shad_sitz@nps.gov","danica_colly@nps.gov","shad_sitz@nps.gov",null,null,null,null,null,null,"glenn_kesler@nps.gov","stefan_lofgren@nps.gov","aaron_robinson@nps.gov","aaron_robinson@nps.gov","aaron_robinson@nps.gov","aaron_robinson@nps.gov","michael.roos@usda.gov","michael.roos@usda.gov","shad_sitz@nps.gov","hugh_anthony@nps.gov","hugh_anthony@nps.gov","mitch_anderson@nps.gov","james_montgomery@nps.gov","james_montgomery@nps.gov","jane_ziolkowski@nps.gov","stefan_lofgren@nps.gov",null,null,null,null,"Owner Email",null,null,null,{"$f":"SUM(AL13:AL151)","v":99},{"$f":"SUM(AM13:AM151)","v":55},{"$f":"SUM(AN13:AN151)","v":8},{"$f":"SUM(AO13:AO151)","v":9},{"$f":"SUM(AP13:AP151)","v":0}]
[null,"Account",null,null,"DR.WHBOI.21NPS158","PF.FSAMD1021.00.1??. .","EMORA. . . . ENOCA . .","DR.WHBOI.20NPS158","PF.FSAMD1020.00.1","DR.WHBOI.20NPS158","PF.FSAMD1020.00.1","PF.FSAMD1020.00.1","DR.WHBOI.20NPS158","WBS: NONE\nCC:PPPWMORAV7\nFA: PPMPRLE1Z.Y00000\nFund: 211P103601","WBS: NONE\nCC: PPPWMORAV0  \nFund:211P1036C1\nFA:PROIESUC1.380000","WBS: PH.P0253570A.00.1\nCC: PPPWNOCAR0\nFund: 20XP103905\nFA: PLCLIAL05.CN0000","WBS: PH.P0237810A.00.1\nCC: PPPWNOCAM2\nFund: 212P103611\nFA: PPMOMFM11.C00000","WBS: PX.P0184310A.00.1\nCC: PPPWNOCA00\nFund: 212P103611\nFA: PPMOMFM11.M00000","WBS: NONE\nCC: PPPWNOCAF0\nFund: 21XP112585\nFA: PF100PP85.Y00000","WBS: PF.FPPWRYPOP.00.1\nCC: PPPWPWROF0  \nFund: 21XP112585 \nFA: PF100PP85.Y00000","WBS: NONE\nCC: PPPWOLYMF1\nFund: 21XP112585 \nFA: PF100PP85.Y00000   ","WBS: PF.FAMORAY21.00.1\nCC: PPPWMORA00   \nFund: XXXP1125C8\nFA: PF56161C8.W00000","WBS: PX.XNCCNM1NM.00.1\nCC: PPPWPWIM10  \nFund: 211P103601  \nFA: PPMRSNR1N.AM0000 ","WBS:  PX.P0258478A.00.1 \nCC:    PPPWMORA00 \nFund:  211P103601\nFA: PPMRSNR1N.AM0000 ","WBS: PA.P0199531A.00.1\nCC: PPPWMORA00  \nFund: XXX  \nFA: POPCF8099.XZ0000 ","WBS: PH.P0216730A.00.1\n","WBS: PH.P0217597A.00.1\n","WBS:  PH.P0248160A.00.1","WBS: NONE\nCC: PPPWMORAV0  \nFund:211P1036C1\nFA:PROIESUC1.380000",null,null,"Project Task Order","All Task Order","Account"]
[null,"Color of Money",null,null,null,null,null,"1-yr","1-yr","1-yr","1-yr","1-yr","1-yr","1-yr","1-yr","Yr2 of 2-yr (use 1st)","2-yr (use 3rd)","2-yr (use last)","1-yr","?","?","1-yr","?","?","no-year","2-yr 2nd year","no-year","?","1-yr",null,null," Totals"," Totals","Color of Money","1-yr","2-year","no-year"]
[null,"Orig Funded Amt",null,null,471905,107050,80200,null,null,null,null,null,null,35000,13000,4500,7000,8000,1500,5000,300,6000,6500,4000,10000,4500,3000,1293.0999999999999,3000,null,null,{"$f":"SUM(N8:AD8)","v":112593.1},{"$f":"SUM(E8:AE8)","v":771748.1},"Orig Funded Amt"]
[null,"Spent",null,null,{"$f":"SUM(E13:E151)","v":430205},{"$f":"SUM(F13:F151)","v":0},{"$f":"SUM(G13:M151)","v":0},{"$f":"SUM(H13:H151)","v":0},0,0,0,0,0,0,0,0,0,0,0,0,0,0,0,0,0,0,0,0,0,0,0,{"$f":"SUM(N9:AD9)","v":0},{"$f":"SUM(E9:AE9)","v":430205},"Spent"]
[null,"Deobligated",null,null,{"$f":"SUM(E152:E152)","v":0},0,0,0,0,0,0,0,0,11000,{"$f":"SUM(O152:O152)","v":0},{"$f":"SUM(P152:P152)","v":0},634.29999999999995,4500,{"$f":"SUM(S152:S152)","v":0},{"$f":"SUM(T152:T152)","v":0},85.8,{"$f":"SUM(V152:V152)","v":0},3900,3208.3,{"$f":"SUM(Y152:Y152)","v":0},0,0,0,0,0,0,{"$f":"SUM(N10:AD10)","v":23328.399999999998},{"$f":"SUM(E10:AE10)","v":23328.399999999998},"Deobligated","2021-09-21","2021-10-31"]
[null,"Balance",null,null,{"$f":"E8-E9-E10","v":41700},{"$f":"F8-F9-F10","v":107050},{"$f":"G8-G9-G10","v":80200},{"$f":"H8-H9-H10","v":0},{"$f":"I8-I9-I10","v":0},{"$f":"J8-J9-J10","v":0},{"$f":"K8-K9-K10","v":0},{"$f":"L8-L9-L10","v":0},0,{"$f":"N8-N9-N10","v":24000},13000,4500,6365.7,{"$f":"R8-R9-R10","v":3500},1500,5000,214.2,6000,2600,{"$f":"X8-X9-X10","v":791.69999999999982},{"$f":"Y8-Y9-Y10","v":10000},4500,3000,1293.0999999999999,{"$f":"AC8-AC9-AC10","v":3000},0,0,{"$f":"SUM(N11:AD11)","v":89264.7},{"$f":"SUM(E11:AE11)","v":318214.7},"Balance"]
[]
[null,"2023-05-05",1,null,{"$f":"'Contract Info'!$D$19","v":3095},null,null,null,null,null,null,null,null,null,null,null,null,null,null,null,null,null,null,null,null,null,null,null,null,null,null,{"$f":"SUM(N13:AE13)","v":0},{"$f":"SUM(E13:AE13)","v":3095},{"$f":"B13","v":"2023-05-05"},null,null,null,1]
[null,{"$f":"B13+1","v":"2023-05-06"},{"$f":"C13+1","v":2},null,{"$f":"'Contract Info'!$D$19","v":3095},null,null,null,null,null,null,null,null,null,null,null,null,null,null,null,null,null,null,null,null,null,null,null,null,null,null,{"$f":"SUM(N14:AE14)","v":0},{"$f":"SUM(E14:AE14)","v":3095},{"$f":"B14","v":"2023-05-06"},null,null,null,1]
[null,{"$f":"B14+1","v":"2023-05-07"},3,null,{"$f":"'Contract Info'!$D$19","v":3095},null,null,null,null,null,null,null,null,null,null,null,null,null,null,null,null,null,null,null,null,null,null,null,null,null,null,0,3095,"2023-05-07",null,null,null,1]
[null,"2023-05-08",4,null,{"$f":"'Contract Info'!$D$19","v":3095},null,null,null,null,null,null,null,null,null,null,null,null,null,null,null,null,null,null,null,null,null,null,null,null,null,null,0,3095,"2023-05-08",null,null,null,1]
[null,"2023-05-09",5,null,{"$f":"'Contract Info'!$D$19","v":3095},null,null,null,null,null,null,null,null,null,null,null,null,null,null,null,null,null,null,null,null,null,null,null,null,null,null,0,3095,{"$f":"B17","v":"2023-05-09"},null,null,null,1]
[null,"2023-05-10",6,null,{"$f":"'Contract Info'!$D$19","v":3095},null,null,null,null,null,null,null,null,null,null,null,null,null,null,null,null,null,null,null,null,null,null,null,null,null,null,0,3095,"2023-05-10",null,null,null,1]
[null,"2023-05-11",7,null,{"$f":"'Contract Info'!$D$19","v":3095},null,null,null,null,null,null,null,null,null,null,null,null,null,null,null,null,null,null,null,null,null,null,null,null,null,null,0,3095,"2023-05-11",null,null,null,1]
[null,"2023-05-12",8,null,{"$f":"'Contract Info'!$D$19","v":3095},null,null,null,null,null,null,null,null,null,null,null,null,null,null,null,null,null,null,null,null,null,null,null,null,null,null,0,3095,"2023-05-12",null,null,null,1]
[null,"2023-05-13",9,null,{"$f":"'Contract Info'!$D$19","v":3095},null,null,null,null,null,null,null,null,null,null,null,null,null,null,null,null,null,null,null,null,null,null,null,null,null,null,0,3095,"2023-05-13",null,null,null,1]
[null,"2023-05-14",10,null,{"$f":"'Contract Info'!$D$19","v":3095},null,null,null,null,null,null,null,null,null,null,null,null,null,null,null,null,null,null,null,null,null,null,null,null,null,null,0,3095,"2023-05-14",null,null,null,1]
[null,"2023-05-15",11,null,{"$f":"'Contract Info'!$D$19","v":3095},null,null,null,null,null,null,null,null,null,null,null,null,null,null,null,null,null,null,null,null,null,null,null,null,null,null,0,3095,"2023-05-15",null,null,null,1]
[null,"2023-05-16",12,null,{"$f":"'Contract Info'!$D$19","v":3095},null,null,null,null,null,null,null,null,null,null,null,null,null,null,null,null,null,null,null,null,null,null,null,null,null,null,0,3095,"2023-05-16",null,null,null,1]
[null,"2023-05-17",13,null,{"$f":"'Contract Info'!$D$19","v":3095},null,null,null,null,null,null,null,null,null,null,null,null,null,null,null,null,null,null,null,null,null,null,null,null,null,null,0,3095,"2023-05-17",null,null,null,1]
[null,"2023-05-18",14,null,{"$f":"'Contract Info'!$D$19","v":3095},null,null,null,null,null,null,null,null,null,null,null,null,null,null,null,null,null,null,null,null,null,null,null,null,null,null,0,3095,"2023-05-18",null,null,null,1]
[null,"2023-05-19",15,null,{"$f":"'Contract Info'!$D$19","v":3095},null,null,null,null,null,null,null,null,null,null,null,null,null,null,null,null,null,null,null,null,null,null,null,null,null,null,0,3095,"2023-05-19",null,null,null,1,1]
[null,"2023-05-20",16,null,{"$f":"'Contract Info'!$D$19","v":3095},null,null,null,null,null,null,null,null,null,null,null,null,null,null,null,null,null,null,null,null,null,null,null,null,null,null,0,3095,"2023-05-20",null,null,null,1,1]
[null,"2023-05-21",17,null,{"$f":"'Contract Info'!$D$19","v":3095},null,null,null,null,null,null,null,null,null,null,null,null,null,null,null,null,null,null,null,null,null,null,null,null,null,null,0,3095,"2023-05-21",null,null,null,1]
[null,"2023-05-22",18,null,{"$f":"'Contract Info'!$D$19","v":3095},null,null,null,null,null,null,null,null,null,null,null,null,null,null,null,null,null,null,null,null,null,null,null,null,null,null,0,3095,"2023-05-22",null,null,null,1,null,1]
[null,{"$f":"B30+1","v":"2023-05-23"},19,null,{"$f":"'Contract Info'!$D$19","v":3095},null,null,null,null,null,null,null,null,null,null,null,null,null,null,null,null,null,null,null,null,null,null,null,null,null,null,0,3095,"2023-05-23",null,null,null,null,null,1]
[null,"2023-05-24",20,null,{"$f":"'Contract Info'!$D$19","v":3095},null,null,null,null,null,null,null,null,null,null,null,null,null,null,null,null,null,null,null,null,null,null,null,null,null,null,0,3095,"2023-05-24",null,null,null,1,null,1]
[null,"2023-05-25",21,null,{"$f":"'Contract Info'!$D$19","v":3095},null,null,null,null,null,null,null,null,null,null,null,null,null,null,null,null,null,null,null,null,null,null,null,null,null,null,0,3095,"2023-05-25",null,null,null,1]
[null,"2023-05-26",22,null,{"$f":"'Contract Info'!$D$19","v":3095},null,null,null,null,null,null,null,null,null,null,null,null,null,null,null,null,null,null,null,null,null,null,null,null,null,null,0,3095,"2023-05-26",null,null,null,1]
[null,"2023-05-27",23,null,{"$f":"'Contract Info'!$D$19","v":3095},null,null,null,null,null,null,null,null,null,null,null,null,null,null,null,null,null,null,null,null,null,null,null,null,null,null,0,3095,"2023-05-27",null,null,null,1]
[null,"2023-05-28",24,null,{"$f":"'Contract Info'!$D$19","v":3095},null,null,null,null,null,null,null,null,null,null,null,null,null,null,null,null,null,null,null,null,null,null,null,null,null,null,0,3095,"2023-05-28",null,null,null,1]
[null,"2023-05-29",25,null,{"$f":"'Contract Info'!$D$19","v":3095},null,null,null,null,null,null,null,null,null,null,null,null,null,null,null,null,null,null,null,null,null,null,null,null,null,null,0,3095,"2023-05-29",null,null,null,1]
[null,"2023-05-30",26,null,{"$f":"'Contract Info'!$D$19","v":3095},null,null,null,null,null,null,null,null,null,null,null,null,null,null,null,null,null,null,null,null,null,null,null,null,null,null,0,3095,"2023-05-30",null,null,null,1]
[null,"2023-05-31",27,null,{"$f":"'Contract Info'!$D$19","v":3095},null,null,null,null,null,null,null,null,null,null,null,null,null,null,null,null,null,null,null,null,null,null,null,null,null,null,0,3095,"2023-05-31",null,null,null,1]
[null,"2023-06-01",28,null,{"$f":"'Contract Info'!$D$19","v":3095},null,null,null,null,null,null,null,null,null,null,null,null,null,null,null,null,null,null,null,null,null,null,null,null,null,null,0,3095,"2023-06-01",null,null,null,1]
[null,"2023-06-02",29,null,{"$f":"'Contract Info'!$D$19","v":3095},null,null,null,null,null,null,null,null,null,null,null,null,null,null,null,null,null,null,null,null,null,null,null,null,null,null,0,3095,"2023-06-02",null,null,null,1]
[null,"2023-06-03",30,null,{"$f":"'Contract Info'!$D$19","v":3095},null,null,null,null,null,null,null,null,null,null,null,null,null,null,null,null,null,null,null,null,null,null,null,null,null,null,0,3095,"2023-06-03",null,null,null,1]
[null,"2023-06-04",31,null,{"$f":"'Contract Info'!$D$19","v":3095},null,null,null,null,null,null,null,null,null,null,null,null,null,null,null,null,null,null,null,null,null,null,null,null,null,null,0,3095,"2023-06-04",null,null,null,1,1]
[null,"2023-06-05",32,null,{"$f":"'Contract Info'!$D$19","v":3095},null,null,null,null,null,null,null,null,null,null,null,null,null,null,null,null,null,null,null,null,null,null,null,null,null,null,0,3095,"2023-06-05",null,null,null,null,1]
[null,"2023-06-06",33,null,{"$f":"'Contract Info'!$D$19","v":3095},null,null,null,null,null,null,null,null,null,null,null,null,null,null,null,null,null,null,null,null,null,null,null,null,null,null,0,3095,"2023-06-06",null,null,null,null,1]
[null,"2023-06-07",34,null,{"$f":"'Contract Info'!$D$19","v":3095},null,null,null,null,null,null,null,null,null,null,null,null,null,null,null,null,null,null,null,null,null,null,null,null,null,null,0,3095,"2023-06-07",null,null,null,1,1]
[null,{"$f":"B46+1","v":"2023-06-08"},35,null,{"$f":"'Contract Info'!$D$19","v":3095},null,null,null,null,null,null,null,null,null,null,null,null,null,null,null,null,null,null,null,null,null,null,null,null,null,null,0,3095,"2023-06-08",null,null,null,1]
[null,"2023-06-09",36,null,{"$f":"'Contract Info'!$D$19","v":3095},null,null,null,null,null,null,null,null,null,null,null,null,null,null,null,null,null,null,null,null,null,null,null,null,null,null,0,3095,"2023-06-09",null,null,null,1]
[null,"2023-06-10",37,null,{"$f":"'Contract Info'!$D$19","v":3095},null,null,null,null,null,null,null,null,null,null,null,null,null,null,null,null,null,null,null,null,null,null,null,null,null,null,0,3095,"2023-06-10",null,null,null,1]
[null,"2023-06-11",38,null,{"$f":"'Contract Info'!$D$19","v":3095},null,null,null,null,null,null,null,null,null,null,null,null,null,null,null,null,null,null,null,null,null,null,null,null,null,null,0,3095,"2023-06-11",null,null,null,1]
[null,"2023-06-12",39,null,{"$f":"'Contract Info'!$D$19","v":3095},null,null,null,null,null,null,null,null,null,null,null,null,null,null,null,null,null,null,null,null,null,null,null,null,null,null,0,3095,"2023-06-12",null,null,null,1]
[null,"2023-06-13",40,null,{"$f":"'Contract Info'!$D$19","v":3095},null,null,null,null,null,null,null,null,null,null,null,null,null,null,null,null,null,null,null,null,null,null,null,null,null,null,0,3095,"2023-06-13",null,null,null,1]
[null,"2023-06-14",41,null,{"$f":"'Contract Info'!$D$19","v":3095},null,null,null,null,null,null,null,null,null,null,null,null,null,null,null,null,null,null,null,null,null,null,null,null,null,null,0,3095,"2023-06-14",null,null,null,1]
[null,"2023-06-15",42,null,{"$f":"'Contract Info'!$D$19","v":3095},null,null,null,null,null,null,null,null,null,null,null,null,null,null,null,null,null,null,null,null,null,null,null,null,null,null,0,3095,"2023-06-15",null,null,null,1,1]
[null,"2023-06-16",43,null,{"$f":"'Contract Info'!$D$19","v":3095},null,null,null,null,null,null,null,null,null,null,null,null,null,null,null,null,null,null,null,null,null,null,null,null,null,null,0,3095,"2023-06-16",null,null,null,null,1]
[null,"2023-06-17",44,null,{"$f":"'Contract Info'!$D$19","v":3095},null,null,null,null,null,null,null,null,null,null,null,null,null,null,null,null,null,null,null,null,null,null,null,null,null,null,0,3095,"2023-06-17",null,null,null,null,1]
[null,"2023-06-18",45,null,{"$f":"'Contract Info'!$D$19","v":3095},null,null,null,null,null,null,null,null,null,null,null,null,null,null,null,null,null,null,null,null,null,null,null,null,null,null,0,3095,"2023-06-18",null,null,null,null,1]
[null,"2023-06-19",46,null,{"$f":"'Contract Info'!$D$19","v":3095},null,null,null,null,null,null,null,null,null,null,null,null,null,null,null,null,null,null,null,null,null,null,null,null,null,null,0,3095,"2023-06-19",null,null,null,null,1]
[null,"2023-06-20",47,null,{"$f":"'Contract Info'!$D$19","v":3095},null,null,null,null,null,null,null,null,null,null,null,null,null,null,null,null,null,null,null,null,null,null,null,null,null,null,0,3095,"2023-06-20",null,null,null,1,1]
[null,"2023-06-21",48,null,{"$f":"'Contract Info'!$D$19","v":3095},null,null,null,null,null,null,null,null,null,null,null,null,null,null,null,null,null,null,null,null,null,null,null,null,null,null,0,3095,"2023-06-21",null,null,null,1]
[null,"2023-06-22",49,null,{"$f":"'Contract Info'!$D$19","v":3095},null,null,null,null,null,null,null,null,null,null,null,null,null,null,null,null,null,null,null,null,null,null,null,null,null,null,0,3095,"2023-06-22",null,null,null,1]
[null,"2023-06-23",50,null,{"$f":"'Contract Info'!$D$19","v":3095},null,null,null,null,null,null,null,null,null,null,null,null,null,null,null,null,null,null,null,null,null,null,null,null,null,null,0,3095,"2023-06-23",null,null,null,1]
[null,{"$f":"B62+1","v":"2023-06-24"},51,null,{"$f":"'Contract Info'!$D$19","v":3095},null,null,null,null,null,null,null,null,null,null,null,null,null,null,null,null,null,null,null,null,null,null,null,null,null,null,0,3095,"2023-06-24",null,null,null,1]
[null,"2023-06-25",52,null,{"$f":"'Contract Info'!$D$19","v":3095},null,null,null,null,null,null,null,null,null,null,null,null,null,null,null,null,null,null,null,null,null,null,null,null,null,null,0,3095,"2023-06-25",null,null,null,1]
[null,"2023-06-26",53,null,{"$f":"'Contract Info'!$D$19","v":3095},null,null,null,null,null,null,null,null,null,null,null,null,null,null,null,null,null,null,null,null,null,null,null,null,null,null,0,3095,"2023-06-26",null,null,null,1]
[null,"2023-06-27",54,null,{"$f":"'Contract Info'!$D$19","v":3095},null,null,null,null,null,null,null,null,null,null,null,null,null,null,null,null,null,null,null,null,null,null,null,null,null,null,0,3095,"2023-06-27",null,null,null,1]
[null,"2023-06-28",55,null,{"$f":"'Contract Info'!$D$19","v":3095},null,null,null,null,null,null,null,null,null,null,null,null,null,null,null,null,null,null,null,null,null,null,null,null,null,null,0,3095,"2023-06-28",null,null,null,1]
[null,"2023-06-29",56,null,{"$f":"'Contract Info'!$D$19","v":3095},null,null,null,null,null,null,null,null,null,null,null,null,null,null,null,null,null,null,null,null,null,null,null,null,null,null,0,3095,"2023-06-29",null,null,null,1]
[null,"2023-06-30",57,null,{"$f":"'Contract Info'!$D$19","v":3095},null,null,null,null,null,null,null,null,null,null,null,null,null,null,null,null,null,null,null,null,null,null,null,null,null,null,0,3095,"2023-06-30",null,null,null,1,null,1]
[null,"2023-07-01",58,null,{"$f":"'Contract Info'!$D$19","v":3095},null,null,null,null,null,null,null,null,null,null,null,null,null,null,null,null,null,null,null,null,null,null,null,null,null,null,0,3095,"2023-07-01",null,null,null,1]
[null,"2023-07-02",59,null,{"$f":"'Contract Info'!$D$19","v":3095},null,null,null,null,null,null,null,null,null,null,null,null,null,null,null,null,null,null,null,null,null,null,null,null,null,null,0,3095,"2023-07-02",null,null,null,1]
[null,"2023-07-03",60,null,{"$f":"'Contract Info'!$D$19","v":3095},null,null,null,null,null,null,null,null,null,null,null,null,null,null,null,null,null,null,null,null,null,null,null,null,null,null,0,3095,"2023-07-03",null,null,null,1]
[null,"2023-07-04",61,null,{"$f":"'Contract Info'!$D$19","v":3095},null,null,null,null,null,null,null,null,null,null,null,null,null,null,null,null,null,null,null,null,null,null,null,null,null,null,0,3095,"2023-07-04",null,null,null,1]
[null,"2023-07-05",62,null,{"$f":"'Contract Info'!$D$19","v":3095},null,null,null,null,null,null,null,null,null,null,null,null,null,null,null,null,null,null,null,null,null,null,null,null,null,null,0,3095,"2023-07-05",null,null,null,1]
[null,"2023-07-06",63,null,{"$f":"'Contract Info'!$D$19","v":3095},null,null,null,null,null,null,null,null,null,null,null,null,null,null,null,null,null,null,null,null,null,null,null,null,null,null,0,3095,"2023-07-06",null,null,null,1,1,1]
[null,"2023-07-07",64,null,{"$f":"'Contract Info'!$D$19","v":3095},null,null,null,null,null,null,null,null,null,null,null,null,null,null,null,null,null,null,null,null,null,null,null,null,null,null,0,3095,"2023-07-07",null,null,null,1,1]
[null,"2023-07-08",65,null,{"$f":"'Contract Info'!$D$19","v":3095},null,null,null,null,null,null,null,null,null,null,null,null,null,null,null,null,null,null,null,null,null,null,null,null,null,null,0,3095,"2023-07-08",null,null,null,1]
[null,"2023-07-09",66,null,{"$f":"'Contract Info'!$D$19","v":3095},null,null,null,null,null,null,null,null,null,null,null,null,null,null,null,null,null,null,null,null,null,null,null,null,null,null,{"$f":"SUM(N78:AE78)","v":0},{"$f":"SUM(E78:AE78)","v":3095},"2023-07-09",null,null,null,1]
[null,{"$f":"B78+1","v":"2023-07-10"},67,null,{"$f":"'Contract Info'!$D$19","v":3095},null,null,null,null,null,null,null,null,null,null,null,null,null,null,null,null,null,null,null,null,null,null,null,null,null,null,0,3095,"2023-07-10",null,null,null,1]
[null,"2023-07-11",68,null,{"$f":"'Contract Info'!$D$19","v":3095},null,null,null,null,null,null,null,null,null,null,null,null,null,null,null,null,null,null,null,null,null,null,null,null,null,null,0,3095,"2023-07-11",null,null,null,1,1,1]
[null,"2023-07-12",69,null,{"$f":"'Contract Info'!$D$19","v":3095},null,null,null,null,null,null,null,null,null,null,null,null,null,null,null,null,null,null,null,null,null,null,null,null,null,null,0,3095,{"$f":"B81","v":"2023-07-12"},null,null,null,null,1]
[null,"2023-07-13",70,null,{"$f":"'Contract Info'!$D$19","v":3095},null,null,null,null,null,null,null,null,null,null,null,null,null,null,null,null,null,null,null,null,null,null,null,null,null,null,0,3095,"2023-07-13",null,null,null,null,1]
[null,"2023-07-14",71,null,{"$f":"'Contract Info'!$D$19","v":3095},null,null,null,null,null,null,null,null,null,null,null,null,null,null,null,null,null,null,null,null,null,null,null,null,null,null,0,3095,"2023-07-14",null,null,null,1,1]
[null,"2023-07-15",72,null,{"$f":"'Contract Info'!$D$19","v":3095},null,null,null,null,null,null,null,null,null,null,null,null,null,null,null,null,null,null,null,null,null,null,null,null,null,null,0,3095,"2023-07-15",null,null,null,1]
[null,"2023-07-16",73,null,{"$f":"'Contract Info'!$D$19","v":3095},null,null,null,null,null,null,null,null,null,null,null,null,null,null,null,null,null,null,null,null,null,null,null,null,null,null,0,3095,"2023-07-16",null,null,null,1]
[null,"2023-07-17",74,null,{"$f":"'Contract Info'!$D$19","v":3095},null,null,null,null,null,null,null,null,null,null,null,null,null,null,null,null,null,null,null,null,null,null,null,null,null,null,0,3095,"2023-07-17",null,null,null,1]
[null,"2023-07-18",75,null,{"$f":"'Contract Info'!$D$19","v":3095},null,null,null,null,null,null,null,null,null,null,null,null,null,null,null,null,null,null,null,null,null,null,null,null,null,null,0,3095,"2023-07-18",null,null,null,1]
[null,"2023-07-19",76,null,{"$f":"'Contract Info'!$D$19","v":3095},null,null,null,null,null,null,null,null,null,null,null,null,null,null,null,null,null,null,null,null,null,null,null,null,null,null,0,3095,"2023-07-19",null,null,null,1]
[null,"2023-07-20",77,null,{"$f":"'Contract Info'!$D$19","v":3095},null,null,null,null,null,null,null,null,null,null,null,null,null,null,null,null,null,null,null,null,null,null,null,null,null,null,0,3095,"2023-07-20",null,null,null,1]
[null,"2023-07-21",78,null,{"$f":"'Contract Info'!$D$19","v":3095},null,null,null,null,null,null,null,null,null,null,null,null,null,null,null,null,null,null,null,null,null,null,null,null,null,null,0,3095,"2023-07-21",null,null,null,1]
[null,"2023-07-22",79,null,{"$f":"'Contract Info'!$D$19","v":3095},null,null,null,null,null,null,null,null,null,null,null,null,null,null,null,null,null,null,null,null,null,null,null,null,null,null,0,3095,"2023-07-22",null,null,null,1]
[null,"2023-07-23",80,null,{"$f":"'Contract Info'!$D$19","v":3095},null,null,null,null,null,null,null,null,null,null,null,null,null,null,null,null,null,null,null,null,null,null,null,null,null,null,0,3095,"2023-07-23",null,null,null,1]
[null,"2023-07-24",81,null,{"$f":"'Contract Info'!$D$19","v":3095},null,null,null,null,null,null,null,null,null,null,null,null,null,null,null,null,null,null,null,null,null,null,null,null,null,null,0,3095,"2023-07-24",null,null,null,1]
[null,"2023-07-25",82,null,{"$f":"'Contract Info'!$D$19","v":3095},null,null,null,null,null,null,null,null,null,null,null,null,null,null,null,null,null,null,null,null,null,null,null,null,null,null,0,3095,"2023-07-25",null,null,null,1]
[null,{"$f":"B94+1","v":"2023-07-26"},83,null,{"$f":"'Contract Info'!$D$19","v":3095},null,null,null,null,null,null,null,null,null,null,null,null,null,null,null,null,null,null,null,null,null,null,null,null,null,null,0,3095,"2023-07-26",null,null,null,1]
[null,"2023-07-27",84,null,{"$f":"'Contract Info'!$D$19","v":3095},null,null,null,null,null,null,null,null,null,null,null,null,null,null,null,null,null,null,null,null,null,null,null,null,null,null,0,3095,"2023-07-27",null,null,null,1]
[null,"2023-07-28",85,null,{"$f":"'Contract Info'!$D$19","v":3095},null,null,null,null,null,null,null,null,null,null,null,null,null,null,null,null,null,null,null,null,null,null,null,null,null,null,0,3095,"2023-07-28",null,null,null,1]
[null,"2023-07-29",86,null,{"$f":"'Contract Info'!$D$19","v":3095},null,null,null,null,null,null,null,null,null,null,null,null,null,null,null,null,null,null,null,null,null,null,null,null,null,null,0,3095,"2023-07-29",null,null,null,1]
[null,"2023-07-30",87,null,{"$f":"'Contract Info'!$D$19","v":3095},null,null,null,null,null,null,null,null,null,null,null,null,null,null,null,null,null,null,null,null,null,null,null,null,null,null,0,3095,"2023-07-30",null,null,null,1]
[null,"2023-07-31",88,null,{"$f":"'Contract Info'!$D$19","v":3095},null,null,null,null,null,null,null,null,null,null,null,null,null,null,null,null,null,null,null,null,null,null,null,null,null,null,0,3095,"2023-07-31",null,null,null,1]
[null,"2023-08-01",89,null,{"$f":"'Contract Info'!$D$19","v":3095},null,null,null,null,null,null,null,null,null,null,null,null,null,null,null,null,null,null,null,null,null,null,null,null,null,null,0,3095,"2023-08-01",null,null,null,1]
[null,"2023-08-02",90,null,{"$f":"'Contract Info'!$D$19","v":3095},null,null,null,null,null,null,null,null,null,null,null,null,null,null,null,null,null,null,null,null,null,null,null,null,null,null,0,3095,"2023-08-02",null,null,null,1,1]
[null,"2023-08-03",91,null,{"$f":"'Contract Info'!$D$19","v":3095},null,null,null,null,null,null,null,null,null,null,null,null,null,null,null,null,null,null,null,null,null,null,null,null,null,null,0,3095,"2023-08-03",null,null,null,null,1]
[null,"2023-08-04",92,null,{"$f":"'Contract Info'!$D$19","v":3095},null,null,null,null,null,null,null,null,null,null,null,null,null,null,null,null,null,null,null,null,null,null,null,null,null,null,0,3095,"2023-08-04",null,null,null,null,1]
[null,"2023-08-05",93,null,{"$f":"'Contract Info'!$D$19","v":3095},null,null,null,null,null,null,null,null,null,null,null,null,null,null,null,null,null,null,null,null,null,null,null,null,null,null,0,3095,"2023-08-05",null,null,null,null,1]
[null,"2023-08-06",94,null,{"$f":"'Contract Info'!$D$19","v":3095},null,null,null,null,null,null,null,null,null,null,null,null,null,null,null,null,null,null,null,null,null,null,null,null,null,null,0,3095,"2023-08-06",null,null,null,null,1]
[null,"2023-08-07",95,null,{"$f":"'Contract Info'!$D$19","v":3095},null,null,null,null,null,null,null,null,null,null,null,null,null,null,null,null,null,null,null,null,null,null,null,null,null,null,0,3095,"2023-08-07",null,null,null,null,1,null,1]
[null,"2023-08-08",96,null,{"$f":"'Contract Info'!$D$19","v":3095},null,null,null,null,null,null,null,null,null,null,null,null,null,null,null,null,null,null,null,null,null,null,null,null,null,null,0,3095,"2023-08-08",null,null,null,null,1,null,1]
[null,"2023-08-09",97,null,{"$f":"'Contract Info'!$D$19","v":3095},null,null,null,null,null,null,null,null,null,null,null,null,null,null,null,null,null,null,null,null,null,null,null,null,null,null,0,3095,"2023-08-09",null,null,null,null,1]
[null,"2023-08-10",98,null,{"$f":"'Contract Info'!$D$19","v":3095},null,null,null,null,null,null,null,null,null,null,null,null,null,null,null,null,null,null,null,null,null,null,null,null,null,null,0,3095,"2023-08-10",null,null,null,null,1]
[null,{"$f":"B110+1","v":"2023-08-11"},99,null,{"$f":"'Contract Info'!$D$19","v":3095},null,null,null,null,null,null,null,null,null,null,null,null,null,null,null,null,null,null,null,null,null,null,null,null,null,null,0,3095,"2023-08-11",null,null,null,null,1]
[null,"2023-08-12",100,null,{"$f":"'Contract Info'!$D$19","v":3095},null,null,null,null,null,null,null,null,null,null,null,null,null,null,null,null,null,null,null,null,null,null,null,null,null,null,0,3095,"2023-08-12",null,null,null,1,1]
[null,"2023-08-13",101,null,{"$f":"'Contract Info'!$D$19","v":3095},null,null,null,null,null,null,null,null,null,null,null,null,null,null,null,null,null,null,null,null,null,null,null,null,null,null,0,3095,"2023-08-13",null,null,null,null,1]
[null,"2023-08-14",102,null,{"$f":"'Contract Info'!$D$19","v":3095},null,null,null,null,null,null,null,null,null,null,null,null,null,null,null,null,null,null,null,null,null,null,null,null,null,null,0,3095,"2023-08-14",null,null,null,1,1,1,1]
[null,"2023-08-15",103,null,{"$f":"'Contract Info'!$D$19","v":3095},null,null,null,null,null,null,null,null,null,null,null,null,null,null,null,null,null,null,null,null,null,null,null,null,null,null,0,3095,"2023-08-15",null,null,null,null,1]
[null,"2023-08-16",104,null,{"$f":"'Contract Info'!$D$19","v":3095},null,null,null,null,null,null,null,null,null,null,null,null,null,null,null,null,null,null,null,null,null,null,null,null,null,null,0,3095,"2023-08-16",null,null,null,null,1,null,1]
[null,"2023-08-17",105,null,{"$f":"'Contract Info'!$D$19","v":3095},null,null,null,null,null,null,null,null,null,null,null,null,null,null,null,null,null,null,null,null,null,null,null,null,null,null,0,3095,"2023-08-17",null,null,null,null,1]
[null,"2023-08-18",106,null,{"$f":"'Contract Info'!$D$19","v":3095},null,null,null,null,null,null,null,null,null,null,null,null,null,null,null,null,null,null,null,null,null,null,null,null,null,null,0,3095,"2023-08-18",null,null,null,1,1]
[null,"2023-08-19",107,null,{"$f":"'Contract Info'!$D$19","v":3095},null,null,null,null,null,null,null,null,null,null,null,null,null,null,null,null,null,null,null,null,null,null,null,null,null,null,0,3095,"2023-08-19",null,null,null,null,1,null,1]
[null,"2023-08-20",108,null,{"$f":"'Contract Info'!$D$19","v":3095},null,null,null,null,null,null,null,null,null,null,null,null,null,null,null,null,null,null,null,null,null,null,null,null,null,null,0,3095,"2023-08-20",null,null,null,null,1]
[null,"2023-08-21",109,null,{"$f":"'Contract Info'!$D$19","v":3095},null,null,null,null,null,null,null,null,null,null,null,null,null,null,null,null,null,null,null,null,null,null,null,null,null,null,0,3095,"2023-08-21",null,null,null,null,1,null,1]
[null,"2023-08-22",110,null,{"$f":"'Contract Info'!$D$19","v":3095},null,null,null,null,null,null,null,null,null,null,null,null,null,null,null,null,null,null,null,null,null,null,null,null,null,null,0,3095,"2023-08-22",null,null,null,null,1,null,1]
[null,"2023-08-23",111,null,{"$f":"'Contract Info'!$D$19","v":3095},null,null,null,null,null,null,null,null,null,null,null,null,null,null,null,null,null,null,null,null,null,null,null,null,null,null,0,3095,"2023-08-23",null,null,null,null,1]
[null,"2023-08-24",112,null,{"$f":"'Contract Info'!$D$19","v":3095},null,null,null,null,null,null,null,null,null,null,null,null,null,null,null,null,null,null,null,null,null,null,null,null,null,null,0,3095,"2023-08-24",null,null,null,null,1]
[null,"2023-08-25",113,null,{"$f":"'Contract Info'!$D$19","v":3095},null,null,null,null,null,null,null,null,null,null,null,null,null,null,null,null,null,null,null,null,null,null,null,null,null,null,0,3095,"2023-08-25",null,null,null,null,1]
[null,"2023-08-26",114,null,{"$f":"'Contract Info'!$D$19","v":3095},null,null,null,null,null,null,null,null,null,null,null,null,null,null,null,null,null,null,null,null,null,null,null,null,null,null,0,3095,"2023-08-26",null,null,null,null,1]
[null,{"$f":"B126+1","v":"2023-08-27"},115,null,{"$f":"'Contract Info'!$D$19","v":3095},null,null,null,null,null,null,null,null,null,null,null,null,null,null,null,null,null,null,null,null,null,null,null,null,null,null,0,3095,"2023-08-27",null,null,null,null,1,null,1]
[null,"2023-08-28",116,null,{"$f":"'Contract Info'!$D$19","v":3095},null,null,null,null,null,null,null,null,null,null,null,null,null,null,null,null,null,null,null,null,null,null,null,null,null,null,0,3095,"2023-08-28",null,null,null,null,1,1]
[null,"2023-08-29",117,null,{"$f":"'Contract Info'!$D$19","v":3095},null,null,null,null,null,null,null,null,null,null,null,null,null,null,null,null,null,null,null,null,null,null,null,null,null,null,0,3095,"2023-08-29",null,null,null,null,1]
[null,"2023-08-30",118,null,{"$f":"'Contract Info'!$D$19","v":3095},null,null,null,null,null,null,null,null,null,null,null,null,null,null,null,null,null,null,null,null,null,null,null,null,null,null,0,3095,"2023-08-30",null,null,null,null,1]
[null,"2023-08-31",119,null,{"$f":"'Contract Info'!$D$19","v":3095},null,null,null,null,null,null,null,null,null,null,null,null,null,null,null,null,null,null,null,null,null,null,null,null,null,null,0,3095,"2023-08-31",null,null,null,null,1]
[null,"2023-09-01",120,null,{"$f":"'Contract Info'!$D$19","v":3095},null,null,null,null,null,null,null,null,null,null,null,null,null,null,null,null,null,null,null,null,null,null,null,null,null,null,0,3095,"2023-09-01",null,null,null,null,1]
[null,"2023-09-02",{"$f":"C132+1","v":121},null,{"$f":"'Contract Info'!$D$19","v":3095},null,null,null,null,null,null,null,null,null,null,null,null,null,null,null,null,null,null,null,null,null,null,null,null,null,null,0,3095,"2023-09-02",null,null,null,null,1]
[null,{"$f":"B133+1","v":"2023-09-03"},{"$f":"C133+1","v":122},null,{"$f":"'Contract Info'!$D$19","v":3095},null,null,null,null,null,null,null,null,null,null,null,null,null,null,null,null,null,null,null,null,null,null,null,null,null,null,0,3095,"2023-09-03",null,null,null,null,1]
[null,{"$f":"B134+1","v":"2023-09-04"},{"$f":"C134+1","v":123},null,{"$f":"'Contract Info'!$D$19","v":3095},null,null,null,null,null,null,null,null,null,null,null,null,null,null,null,null,null,null,null,null,null,null,null,null,null,null,0,3095,"2023-09-04",null,null,null,null,1]
[null,{"$f":"B135+1","v":"2023-09-05"},{"$f":"C135+1","v":124},null,{"$f":"'Contract Info'!$D$19","v":3095},null,null,null,null,null,null,null,null,null,null,null,null,null,null,null,null,null,null,null,null,null,null,null,null,null,null,0,3095,"2023-09-05",null,null,null,null,1]
[null,{"$f":"B136+1","v":"2023-09-06"},{"$f":"C136+1","v":125},null,{"$f":"'Contract Info'!$D$19","v":3095},null,null,null,null,null,null,null,null,null,null,null,null,null,null,null,null,null,null,null,null,null,null,null,null,null,null,0,3095,"2023-09-06",null,null,null,1,1]
[null,"2023-09-07",126,null,{"$f":"'Contract Info'!$D$19","v":3095},null,null,null,null,null,null,null,null,null,null,null,null,null,null,null,null,null,null,null,null,null,null,null,null,null,null,0,3095,"2023-09-07",null,null,null,1]
[null,"2023-09-08",127,null,{"$f":"'Contract Info'!$D$19","v":3095},null,null,null,null,null,null,null,null,null,null,null,null,null,null,null,null,null,null,null,null,null,null,null,null,null,null,0,3095,"2023-09-08",null,null,null,1]
[null,"2023-09-09",128,null,{"$f":"'Contract Info'!$D$19","v":3095},null,null,null,null,null,null,null,null,null,null,null,null,null,null,null,null,null,null,null,null,null,null,null,null,null,null,0,3095,"2023-09-09",null,null,null,1]
[null,"2023-09-10",129,null,{"$f":"'Contract Info'!$D$19","v":3095},null,null,null,null,null,null,null,null,null,null,null,null,null,null,null,null,null,null,null,null,null,null,null,null,null,null,0,3095,"2023-09-10",null,null,null,1]
[null,"2023-09-11",130,null,{"$f":"'Contract Info'!$D$19","v":3095},null,null,null,null,null,null,null,null,null,null,null,null,null,null,null,null,null,null,null,null,null,null,null,null,null,null,{"$f":"SUM(N142:AE142)","v":0},{"$f":"SUM(E142:AE142)","v":3095},"2023-09-11",null,null,null,1]
[null,"2023-09-12",131,null,{"$f":"'Contract Info'!$D$19","v":3095},null,null,null,null,null,null,null,null,null,null,null,null,null,null,null,null,null,null,null,null,null,null,null,null,null,null,0,3095,"2023-09-12",null,null,null,1]
[null,"2023-09-13",132,null,{"$f":"'Contract Info'!$D$19","v":3095},null,null,null,null,null,null,null,null,null,null,null,null,null,null,null,null,null,null,null,null,null,null,null,null,null,null,0,3095,"2023-09-13",null,null,null,1]
[null,"2023-09-14",133,null,{"$f":"'Contract Info'!$D$19","v":3095},null,null,null,null,null,null,null,null,null,null,null,null,null,null,null,null,null,null,null,null,null,null,null,null,null,null,0,3095,{"$f":"B145","v":"2023-09-14"},null,null,null,1]
[null,"2023-09-15",134,null,{"$f":"'Contract Info'!$D$19","v":3095},null,null,null,null,null,null,null,null,null,null,null,null,null,null,null,null,null,null,null,null,null,null,null,null,null,null,0,3095,"2023-09-15",null,null,null,1]
[null,"2023-09-16",135,null,{"$f":"'Contract Info'!$D$19","v":3095},null,null,null,null,null,null,null,null,null,null,null,null,null,null,null,null,null,null,null,null,null,null,null,null,null,null,0,3095,"2023-09-16",null,null,null,1,1,null,1]
[null,"2023-09-17",136,null,{"$f":"'Contract Info'!$D$19","v":3095},null,null,null,null,null,null,null,null,null,null,null,null,null,null,null,null,null,null,null,null,null,null,null,null,null,null,0,3095,"2023-09-17",null,null,null,1]
[null,"2023-09-18",137,null,{"$f":"'Contract Info'!$D$19","v":3095},null,null,null,null,null,null,null,null,null,null,null,null,null,null,null,null,null,null,null,null,null,null,null,null,null,null,0,3095,"2023-09-18",null,null,null,1]
[null,"2023-09-19",138,null,{"$f":"'Contract Info'!$D$19","v":3095},null,null,null,null,null,null,null,null,null,null,null,null,null,null,null,null,null,null,null,null,null,null,null,null,null,null,0,3095,"2023-09-19",null,null,null,1]
[null,{"$f":"B150+1","v":"2023-09-20"},139,null,{"$f":"'Contract Info'!$D$19","v":3095},null,null,null,null,null,null,null,null,null,null,null,null,null,null,null,null,null,null,null,null,null,null,null,null,null,null,0,3095,"2023-09-20",null,null,null,1]
[null,"2020-12-16","De-Ob","Mod 08",null,null,null,null,null,null,null,null,null,null,null,null,null,null,null,null,null,null,null,null,null,null,null,null,null,null,null,0,0,"2020-12-16"]
[null,null,null,null,null,null,null,null,null,null,null,null,null,null,null,null,null,null,null,null,null,null,null,null,null,null,null,null,null,null,null,{"$f":"SUM(AF13:AF151)","v":0},null,"00:00:00"]

{"sheet":"Contract Totals Details","index":2,"n_rows":135,"n_cols":53,"rows_kept":135,"cut":false,"hidden":false,"merged":[[130,2,130,7],[0,0,0,7],[109,32,109,37],[109,38,109,43],[109,44,109,49],[27,2,27,7],[47,2,47,7],[67,2,67,7],[87,2,87,7],[109,2,109,7],[67,38,67,43],[67,44,67,49],[87,8,87,13],[87,14,87,19],[87,20,87,25],[87,26,87,31],[87,32,87,37],[87,38,87,43],[87,44,87,49],[67,8,67,13],[67,14,67,19],[67,20,67,25],[67,26,67,31],[67,32,67,37],[27,26,27,31],[27,32,27,37],[47,8,47,13],[47,14,47,19],[47,20,47,25],[47,26,47,31],[47,32,47,37],[1,32,1,37],[1,2,1,7],[0,8,0,49],[28,32,28,37],[28,2,28,7],[28,8,28,13],[28,14,28,19],[28,20,28,25],[28,26,28,31],[1,14,1,19],[1,8,1,13],[1,20,1,25],[1,26,1,31],[27,8,27,13],[27,14,27,19],[27,20,27,25],[48,32,48,37],[68,2,68,7],[68,8,68,13],[68,14,68,19],[68,20,68,25],[68,26,68,31],[68,32,68,37],[48,2,48,7],[48,8,48,13],[48,14,48,19],[48,20,48,25],[48,26,48,31],[88,20,88,25],[88,26,88,31],[110,32,110,37],[110,2,110,7],[110,8,110,13],[110,14,110,19],[110,20,110,25],[110,26,110,31],[88,32,88,37],[88,2,88,7],[88,8,88,13],[88,14,88,19],[109,8,109,13],[109,14,109,19],[109,20,109,25],[109,26,109,31],[110,38,110,43],[1,44,1,49],[28,44,28,49],[48,44,48,49],[68,44,68,49],[88,44,88,49],[110,44,110,49],[1,38,1,43],[28,38,28,43],[48,38,48,43],[68,38,68,43],[88,38,88,43],[27,38,27,43],[27,44,27,49],[47,38,47,43],[47,44,47,49]]}
["2021 NW Exclusive Use Contract Totals  (May 2 thru Sep 17)",null,null,null,null,null,null,null,"2021 MOCA Contract Totals by Month"]
[null,"TOTALS FOR ALL LOCATIONS","139-day Contract TOTALS",null,null,null,null,null,"May",null,null,null,null,null,"June",null,null,null,null,null,"July",null,null,null,null,null,"August",null,null,null,null,null,"September",null,null,null,null,null,"October",null,null,null,null,null,"November",null,null,null,null,null,null,"SuperManager formula location"]
[null,"All Parks & other locations","Availability","SAR","Project","Training","Fire","Total","Availability","SAR","Project","Training","Fire","Total","Availability","SAR (operational)","Project","Training","Fire","Total","Availability","SAR (operational)","Project","Training","Fire","Total","Availability","SAR (operational)","Project","Training","Fire","Total","Availability","SAR (operational)","Project","Training","Fire","Total","Availability","SAR (operational)","Project","Training","Fire","Total","Availability","SAR (operational)","Project","Training","Fire","Total"]
[null,"Total Cost",{"$f":"SUM(I4,O4,U4,AA4,AG4,AM4,AS4)","v":424899.28571428568},{"$error":"#REF!"},{"$error":"#REF!"},{"$error":"#REF!"},{"$error":"#REF!"},{"$error":"#REF!"},{"$f":"N5","v":92850},{"$f":"J9+J10+J11+J12+J13","v":{"$error":"#REF!"}},{"$f":"K9+K10+K11+K12+K13","v":0},{"$f":"L9+L10+L11+L12+L13","v":{"$error":"#REF!"}},{"$f":"M9+M10+M11+M12+M13","v":0},{"$f":"SUM(I4:M4)","v":{"$error":"#REF!"}},{"$f":"T5","v":87544.28571428571},{"$f":"P9+P10+P11+P12+P13","v":{"$error":"#REF!"}},{"$f":"Q9+Q10+Q11+Q12+Q13","v":{"$error":"#REF!"}},{"$f":"R9+R10+R11+R12+R13","v":{"$error":"#REF!"}},{"$f":"S9+S10+S11+S12+S13","v":0},{"$f":"SUM(O4:S4)","v":{"$error":"#REF!"}},{"$f":"Z5","v":95945},{"$f":"V9+V10+V11+V12+V13","v":{"$error":"#REF!"}},{"$f":"W9+W10+W11+W12+W13","v":{"$error":"#REF!"}},{"$f":"X9+X10+X11+X12+X13","v":{"$error":"#REF!"}},{"$f":"Y9+Y10+Y11+Y12+Y13","v":{"$error":"#REF!"}},{"$f":"SUM(U4:Y4)","v":{"$error":"#REF!"}},{"$f":"AF5","v":95945},{"$f":"AB9+AB10+AB11+AB12+AB13","v":{"$error":"#REF!"}},{"$f":"AC9+AC10+AC11+AC12+AC13","v":{"$error":"#REF!"}},{"$f":"AD9+AD10+AD11+AD12+AD13","v":{"$error":"#REF!"}},{"$f":"AE9+AE10+AE11+AE12+AE13","v":{"$error":"#REF!"}},{"$f":"SUM(AA4:AE4)","v":{"$error":"#REF!"}},{"$f":"AL5","v":52615},{"$f":"AH9+AH10+AH11+AH12+AH13","v":{"$error":"#REF!"}},{"$f":"AI9+AI10+AI11+AI12+AI13","v":{"$error":"#REF!"}},{"$f":"AJ9+AJ10+AJ11+AJ12+AJ13","v":{"$error":"#REF!"}},{"$f":"AK9+AK10+AK11+AK12+AK13","v":{"$error":"#REF!"}},{"$f":"SUM(AG4:AK4)","v":{"$error":"#REF!"}},{"$f":"AR5","v":0},{"$f":"AN9+AN10+AN11+AN12+AN13","v":0},{"$f":"AO9+AO10+AO11+AO12+AO13","v":0},{"$f":"AP9+AP10+AP11+AP12+AP13","v":0},{"$f":"AQ9+AQ10+AQ11+AQ12+AQ13","v":0},{"$f":"SUM(AM4:AQ4)","v":0},{"$f":"AX5","v":0},{"$f":"AT9+AT10+AT11+AT12+AT13","v":0},{"$f":"AU9+AU10+AU11+AU12+AU13","v":0},{"$f":"AV9+AV10+AV11+AV12+AV13","v":0},{"$f":"AW9+AW10+AW11+AW12+AW13","v":0},{"$f":"SUM(AS4:AW4)","v":0}]
[null,"Availability Cost",{"$f":"SUM(N5,T5,Z5,AF5,AL5,AR5,AX5)","v":424899.28571428568},{"$f":"'Contract Info'!$D$19*D6","v":424899.28571428568},{"$f":"'Contract Info'!$D$19*E6","v":0},{"$f":"'Contract Info'!$D$19*F6","v":0},{"$f":"'Contract Info'!$D$19*G6","v":0},{"$f":"SUM(D5:G5)","v":424899.28571428568},null,{"$f":"'Contract Info'!$D$19*J6","v":92850},{"$f":"'Contract Info'!$D$19*K6","v":0},{"$f":"'Contract Info'!$D$19*L6","v":0},{"$f":"'Contract Info'!$D$19*M6","v":0},{"$f":"SUM(J5:M5)","v":92850},null,{"$f":"'Contract Info'!$D$19*P6","v":87544.28571428571},{"$f":"'Contract Info'!$D$19*Q6","v":0},null,{"$f":"'Contract Info'!$D$19*S6","v":0},{"$f":"SUM(P5:S5)","v":87544.28571428571},null,{"$f":"'Contract Info'!$D$19*V6","v":95945},{"$f":"'Contract Info'!$D$19*W6","v":0},null,{"$f":"'Contract Info'!$D$19*Y6","v":0},{"$f":"SUM(V5:Y5)","v":95945},null,{"$f":"'Contract Info'!$D$19*AB6","v":95945},{"$f":"'Contract Info'!$D$19*AC6","v":0},null,{"$f":"'Contract Info'!$D$19*AE6","v":0},{"$f":"SUM(AB5:AE5)","v":95945},null,{"$f":"'Contract Info'!$D$19*AH6","v":52615},{"$f":"'Contract Info'!$D$19*AI6","v":0},null,{"$f":"'Contract Info'!$D$19*AK6","v":0},{"$f":"SUM(AH5:AK5)","v":52615},null,{"$f":"'Contract Info'!$D$19*AN6","v":0},{"$f":"'Contract Info'!$D$19*AO6","v":0},null,0,{"$f":"SUM(AN5:AQ5)","v":0},null,{"$f":"'Contract Info'!$D$19*AT6","v":0},{"$f":"'Contract Info'!$D$19*AU6","v":0},null,{"$f":"'Contract Info'!$D$19*AW6","v":0},{"$f":"SUM(AT5:AW5)","v":0}]
[null,"Availability Days",null,{"$f":"SUM(J6,P6,V6,AB6,AH6,AN6,AT6)","v":137.28571428571428},0,0,0,{"$f":"SUM(D6:G6)","v":137.28571428571428},null,30,{"$f":"SUM(Q6,W6,AC6,AI6,AO6,AU6,BA6)","v":0},{"$f":"SUM(R6,X6,AD6,AJ6,AP6,AV6,BB6)","v":0},0,{"$f":"SUM(J6:M6)","v":30},null,{"$f":"28+4/14","v":28.285714285714285},{"$f":"SUM(W6,AC6,AI6,AO6,AU6,BA6,BF6)","v":0},null,0,{"$f":"SUM(P6:S6)","v":28.285714285714285},null,31,{"$f":"SUM(AC6,AI6,AO6,AU6,BA6,BF6,BK6)","v":0},null,0,{"$f":"SUM(V6:Y6)","v":31},null,31,{"$f":"SUM(AI6,AO6,AU6,BA6,BF6,BK6,BP6)","v":0},null,0,{"$f":"SUM(AB6:AE6)","v":31},null,17,{"$f":"SUM(AO6,AU6,BA6,BF6,BK6,BP6,BU6)","v":0},null,0,{"$f":"SUM(AH6:AK6)","v":17},null,0,{"$f":"SUM(AU6,BA6,BF6,BK6,BP6,BU6,BZ6)","v":0},null,0,0,null,0,{"$f":"SUM(BA6,BF6,BK6,BP6,BU6,BZ6,CE6)","v":0},null,null,{"$f":"SUM(AT6:AW6)","v":0},null,null,"Total Cost"]
[null,"Flight Time Hours",null,{"$error":"#REF!"},{"$error":"#REF!"},{"$error":"#REF!"},{"$error":"#REF!"},{"$f":"SUM(D7:G7)","v":{"$error":"#REF!"}},{"$f":"H32+H52+H72+H92+H114","v":{"$error":"#REF!"}},{"$f":"SUM(#REF!,#REF!,#REF!)","v":{"$error":"#REF!"}},0,{"$f":"SUM(#REF!,#REF!,#REF!,#REF!,#REF!,#REF!,#REF!,#REF!,#REF!,#REF!,#REF!,#REF!,#REF!,#REF!)","v":{"$error":"#REF!"}},0,{"$error":"#REF!"},null,{"$f":"SUM(#REF!,#REF!,#REF!,#REF!,#REF!,#REF!,#REF!)","v":{"$error":"#REF!"}},{"$f":"SUM(#REF!,#REF!,#REF!,#REF!,#REF!,#REF!,#REF!,#REF!,#REF!)","v":{"$error":"#REF!"}},{"$f":"SUM(#REF!,#REF!,#REF!,#REF!,#REF!,#REF!,#REF!,#REF!,#REF!)","v":{"$error":"#REF!"}},0,{"$error":"#REF!"},null,{"$f":"SUM(#REF!,#REF!,#REF!,#REF!,#REF!,#REF!,#REF!,#REF!)","v":{"$error":"#REF!"}},{"$f":"SUM(#REF!,#REF!,#REF!,#REF!,#REF!,#REF!,#REF!,#REF!,#REF!,#REF!,#REF!)","v":{"$error":"#REF!"}},{"$f":"SUM(#REF!,#REF!,#REF!,#REF!,#REF!)","v":{"$error":"#REF!"}},{"$f":"SUM(#REF!,#REF!,#REF!,#REF!,#REF!)","v":{"$error":"#REF!"}},{"$f":"SUM(V7:Y7)","v":{"$error":"#REF!"}},null,{"$f":"SUM(#REF!,#REF!,#REF!,#REF!,#REF!,#REF!,#REF!,#REF!,#REF!)","v":{"$error":"#REF!"}},{"$f":"SUM(#REF!,#REF!)","v":{"$error":"#REF!"}},{"$f":"SUM(#REF!)","v":{"$error":"#REF!"}},{"$f":"SUM(#REF!,#REF!,#REF!,#REF!,#REF!,#REF!,#REF!,#REF!,#REF!,#REF!,#REF!,#REF!,#REF!,#REF!,#REF!,#REF!,#REF!,#REF!,#REF!,#REF!,#REF!,#REF!,#REF!,#REF!,#REF!,#REF!,#REF!,#REF!,#REF!,#REF!,#REF!,#REF!,#REF!,#REF!,#REF!,#REF!,#REF!,#REF!,#REF!,#REF!,#REF!,#REF!,#REF!)","v":{"$error":"#REF!"}},{"$f":"SUM(AB7:AE7)","v":{"$error":"#REF!"}},null,{"$f":"SUM(#REF!)","v":{"$error":"#REF!"}},{"$f":"SUM(#REF!,#REF!,#REF!,#REF!,#REF!,#REF!,#REF!,#REF!,#REF!,#REF!,#REF!,#REF!)","v":{"$error":"#REF!"}},{"$f":"SUM(#REF!)","v":{"$error":"#REF!"}},{"$f":"SUM(#REF!,#REF!,#REF!,#REF!,#REF!)","v":{"$error":"#REF!"}},{"$f":"SUM(AH7:AK7)","v":{"$error":"#REF!"}},null,0,0,0,0,{"$f":"SUM(AN7:AQ7)","v":0},null,0,0,null,0,{"$f":"SUM(AT7:AW7)","v":0},null,"AH16:AL17","Flight Time Hours"]
[null,"Flight Time Percentage",null,{"$f":"IF(SUM(D7:G7)=0,0,D7/SUM(D7:G7))","v":{"$error":"#REF!"}},{"$f":"IF(SUM(D7:G7)=0,0,E7/SUM(D7:G7))","v":{"$error":"#REF!"}},{"$f":"IF(SUM(D7:G7)=0,0,F7/SUM(D7:G7))","v":{"$error":"#REF!"}},{"$f":"IF(SUM(D7:G7)=0,0,G7/SUM(D7:G7))","v":{"$error":"#REF!"}},{"$f":"SUM(D8:G8)","v":{"$error":"#REF!"}},null,{"$f":"IF(SUM(J7:M7)=0,0,J7/SUM(J7:M7))","v":{"$error":"#REF!"}},{"$f":"IF(SUM(J7:M7)=0,0,K7/SUM(J7:M7))","v":{"$error":"#REF!"}},{"$f":"IF(SUM(J7:M7)=0,0,L7/SUM(J7:M7))","v":{"$error":"#REF!"}},{"$f":"IF(SUM(J7:M7)=0,0,M7/SUM(J7:M7))","v":{"$error":"#REF!"}},{"$f":"SUM(J8:M8)","v":{"$error":"#REF!"}},null,{"$f":"IF(SUM(P7:S7)=0,0,P7/SUM(P7:S7))","v":{"$error":"#REF!"}},{"$f":"IF(SUM(P7:S7)=0,0,Q7/SUM(P7:S7))","v":{"$error":"#REF!"}},{"$f":"IF(SUM(P7:S7)=0,0,R7/SUM(P7:S7))","v":{"$error":"#REF!"}},{"$f":"IF(SUM(P7:S7)=0,0,S7/SUM(P7:S7))","v":{"$error":"#REF!"}},{"$f":"SUM(P8:S8)","v":{"$error":"#REF!"}},null,{"$f":"IF(SUM(V7:Y7)=0,0,V7/SUM(V7:Y7))","v":{"$error":"#REF!"}},{"$f":"IF(SUM(V7:Y7)=0,0,W7/SUM(V7:Y7))","v":{"$error":"#REF!"}},{"$f":"IF(SUM(V7:Y7)=0,0,X7/SUM(V7:Y7))","v":{"$error":"#REF!"}},{"$f":"IF(SUM(V7:Y7)=0,0,Y7/SUM(V7:Y7))","v":{"$error":"#REF!"}},{"$f":"SUM(V8:Y8)","v":{"$error":"#REF!"}},null,{"$f":"IF(SUM(AB7:AE7)=0,0,AB7/SUM(AB7:AE7))","v":{"$error":"#REF!"}},{"$f":"IF(SUM(AB7:AE7)=0,0,AC7/SUM(AB7:AE7))","v":{"$error":"#REF!"}},{"$f":"IF(SUM(AB7:AE7)=0,0,AD7/SUM(AB7:AE7))","v":{"$error":"#REF!"}},{"$f":"IF(SUM(AB7:AE7)=0,0,AE7/SUM(AB7:AE7))","v":{"$error":"#REF!"}},{"$f":"SUM(AB8:AE8)","v":{"$error":"#REF!"}},null,{"$f":"IF(SUM(AH7:AK7)=0,0,AH7/SUM(AH7:AK7))","v":{"$error":"#REF!"}},{"$f":"IF(SUM(AH7:AK7)=0,0,AI7/SUM(AH7:AK7))","v":{"$error":"#REF!"}},{"$f":"IF(SUM(AH7:AK7)=0,0,AJ7/SUM(AH7:AK7))","v":{"$error":"#REF!"}},{"$f":"IF(SUM(AH7:AK7)=0,0,AK7/SUM(AH7:AK7))","v":{"$error":"#REF!"}},{"$f":"SUM(AH8:AK8)","v":{"$error":"#REF!"}},null,{"$f":"IF(SUM(AN7:AQ7)=0,0,AN7/SUM(AN7:AQ7))","v":0},{"$f":"IF(SUM(AN7:AQ7)=0,0,AO7/SUM(AN7:AQ7))","v":0},{"$f":"IF(SUM(AO7:AR7)=0,0,AP7/SUM(AO7:AR7))","v":0},{"$f":"IF(SUM(AN7:AQ7)=0,0,AQ7/SUM(AN7:AQ7))","v":0},{"$f":"SUM(AN8:AQ8)","v":0},null,{"$f":"IF(SUM(AT7:AW7)=0,0,AT7/SUM(AT7:AW7))","v":0},{"$f":"IF(SUM(AT7:AW7)=0,0,AU7/SUM(AT7:AW7))","v":0},{"$f":"IF(SUM(AU7:AX7)=0,0,AV7/SUM(AU7:AX7))","v":0},{"$f":"IF(SUM(AT7:AW7)=0,0,AW7/SUM(AT7:AW7))","v":0},{"$f":"SUM(AT8:AW8)","v":0},null,null,"Flight Time Percentage"]
[null,"Flight Time Cost",null,{"$f":"SUM(J9,P9,V9,AB9,AH9,AN9,AT9)","v":{"$error":"#REF!"}},{"$error":"#REF!"},{"$error":"#REF!"},{"$error":"#REF!"},{"$f":"SUM(D9:G9)","v":{"$error":"#REF!"}},{"$f":"H34+H54+H74+H94+H116","v":{"$error":"#REF!"}},{"$f":"J7*'Contract Info'!$D$18","v":{"$error":"#REF!"}},{"$f":"K7*'Contract Info'!$D$18","v":0},{"$f":"L7*'Contract Info'!$D$18","v":{"$error":"#REF!"}},{"$f":"M7*'Contract Info'!E18","v":0},{"$error":"#REF!"},null,{"$f":"P7*'Contract Info'!$D$18","v":{"$error":"#REF!"}},{"$f":"Q7*'Contract Info'!$D$18","v":{"$error":"#REF!"}},{"$f":"R7*'Contract Info'!$D$18","v":{"$error":"#REF!"}},{"$f":"S7*'Contract Info'!$D$18","v":0},{"$error":"#REF!"},null,{"$f":"V7*'Contract Info'!$D$18","v":{"$error":"#REF!"}},{"$f":"W7*'Contract Info'!$D$18","v":{"$error":"#REF!"}},{"$f":"X7*'Contract Info'!$D$18","v":{"$error":"#REF!"}},{"$f":"Y7*'Contract Info'!$D$18","v":{"$error":"#REF!"}},{"$f":"SUM(V9:Y9)","v":{"$error":"#REF!"}},null,{"$f":"AB7*'Contract Info'!$D$18","v":{"$error":"#REF!"}},{"$f":"AC7*'Contract Info'!$D$18","v":{"$error":"#REF!"}},{"$f":"AD7*'Contract Info'!$D$18","v":{"$error":"#REF!"}},{"$f":"AE7*'Contract Info'!$D$18","v":{"$error":"#REF!"}},{"$f":"SUM(AB9:AE9)","v":{"$error":"#REF!"}},null,{"$f":"AH7*'Contract Info'!$D$18","v":{"$error":"#REF!"}},{"$f":"AI7*'Contract Info'!$D$18","v":{"$error":"#REF!"}},{"$f":"AJ7*'Contract Info'!$D$18","v":{"$error":"#REF!"}},{"$f":"AK7*'Contract Info'!$D$18","v":{"$error":"#REF!"}},{"$error":"#REF!"},null,{"$f":"AN7*'Contract Info'!$D$18","v":0},{"$f":"AO7*'Contract Info'!$D$18","v":0},{"$f":"AP7*'Contract Info'!$D$18","v":0},{"$f":"AQ7*'Contract Info'!$D$18","v":0},0,null,{"$f":"AT7*'Contract Info'!$D$18","v":0},{"$f":"AU7*'Contract Info'!$D$18","v":0},{"$f":"AV7*'Contract Info'!$D$18","v":0},{"$f":"AW7*'Contract Info'!$D$18","v":0},0,null,null,"Flight Time Cost"]
[null,"Extended Standby Cost",null,{"$error":"#REF!"},{"$error":"#REF!"},{"$error":"#REF!"},{"$error":"#REF!"},{"$error":"#REF!"},{"$error":"#REF!"},{"$f":"SUM(#REF!,#REF!,#REF!)","v":{"$error":"#REF!"}},0,{"$f":"SUM(#REF!,#REF!,#REF!,#REF!,#REF!,#REF!,#REF!,#REF!,#REF!,#REF!,#REF!,#REF!,#REF!,#REF!)","v":{"$error":"#REF!"}},0,{"$error":"#REF!"},null,{"$f":"SUM(#REF!,#REF!,#REF!,#REF!,#REF!,#REF!,#REF!)","v":{"$error":"#REF!"}},{"$f":"SUM(#REF!,#REF!,#REF!,#REF!,#REF!,#REF!,#REF!,#REF!,#REF!)","v":{"$error":"#REF!"}},{"$f":"SUM(#REF!,#REF!,#REF!,#REF!,#REF!,#REF!,#REF!,#REF!,#REF!)","v":{"$error":"#REF!"}},0,{"$error":"#REF!"},null,{"$f":"SUM(#REF!,#REF!,#REF!,#REF!,#REF!,#REF!,#REF!,#REF!)","v":{"$error":"#REF!"}},{"$f":"SUM(#REF!,#REF!,#REF!,#REF!,#REF!,#REF!,#REF!,#REF!,#REF!,#REF!,#REF!)","v":{"$error":"#REF!"}},{"$f":"SUM(#REF!,#REF!,#REF!,#REF!,#REF!)","v":{"$error":"#REF!"}},{"$f":"SUM(#REF!,#REF!,#REF!,#REF!,#REF!)","v":{"$error":"#REF!"}},{"$error":"#REF!"},null,{"$f":"SUM(#REF!,#REF!,#REF!,#REF!,#REF!,#REF!,#REF!,#REF!,#REF!)","v":{"$error":"#REF!"}},{"$f":"SUM(#REF!,#REF!)","v":{"$error":"#REF!"}},{"$f":"SUM(#REF!)","v":{"$error":"#REF!"}},{"$f":"SUM(#REF!,#REF!,#REF!,#REF!,#REF!,#REF!,#REF!,#REF!,#REF!,#REF!,#REF!,#REF!,#REF!,#REF!,#REF!,#REF!,#REF!,#REF!,#REF!,#REF!,#REF!,#REF!,#REF!,#REF!,#REF!,#REF!,#REF!,#REF!,#REF!,#REF!,#REF!,#REF!,#REF!,#REF!,#REF!,#REF!,#REF!,#REF!,#REF!,#REF!,#REF!,#REF!,#REF!)","v":{"$error":"#REF!"}},{"$error":"#REF!"},null,{"$f":"SUM(#REF!)","v":{"$error":"#REF!"}},{"$f":"SUM(#REF!,#REF!,#REF!,#REF!,#REF!,#REF!,#REF!,#REF!,#REF!,#REF!,#REF!,#REF!)","v":{"$error":"#REF!"}},{"$f":"SUM(#REF!)","v":{"$error":"#REF!"}},{"$f":"SUM(#REF!,#REF!,#REF!,#REF!,#REF!)","v":{"$error":"#REF!"}},{"$error":"#REF!"},null,0,0,0,0,0,null,0,0,0,0,0,null,"AS20:AX25","Extended Standby Cost"]
[null,"Per Diem Cost",null,{"$error":"#REF!"},{"$error":"#REF!"},{"$error":"#REF!"},{"$error":"#REF!"},{"$error":"#REF!"},{"$error":"#REF!"},{"$f":"SUM(#REF!,#REF!,#REF!)","v":{"$error":"#REF!"}},0,{"$f":"SUM(#REF!,#REF!,#REF!,#REF!,#REF!,#REF!,#REF!,#REF!,#REF!,#REF!,#REF!,#REF!,#REF!,#REF!)","v":{"$error":"#REF!"}},0,{"$error":"#REF!"},null,{"$f":"SUM(#REF!,#REF!,#REF!,#REF!,#REF!,#REF!,#REF!)","v":{"$error":"#REF!"}},{"$f":"SUM(#REF!,#REF!,#REF!,#REF!,#REF!,#REF!,#REF!,#REF!,#REF!)","v":{"$error":"#REF!"}},{"$f":"SUM(#REF!,#REF!,#REF!,#REF!,#REF!,#REF!,#REF!,#REF!,#REF!)","v":{"$error":"#REF!"}},0,{"$error":"#REF!"},null,{"$f":"SUM(#REF!,#REF!,#REF!,#REF!,#REF!,#REF!,#REF!,#REF!)","v":{"$error":"#REF!"}},{"$f":"SUM(#REF!,#REF!,#REF!,#REF!,#REF!,#REF!,#REF!,#REF!,#REF!,#REF!,#REF!)","v":{"$error":"#REF!"}},{"$f":"SUM(#REF!,#REF!,#REF!,#REF!,#REF!)","v":{"$error":"#REF!"}},{"$f":"SUM(#REF!,#REF!,#REF!,#REF!,#REF!)","v":{"$error":"#REF!"}},{"$error":"#REF!"},null,{"$f":"SUM(#REF!,#REF!,#REF!,#REF!,#REF!,#REF!,#REF!,#REF!,#REF!)","v":{"$error":"#REF!"}},{"$f":"SUM(#REF!,#REF!)","v":{"$error":"#REF!"}},{"$f":"SUM(#REF!)","v":{"$error":"#REF!"}},{"$f":"SUM(#REF!,#REF!,#REF!,#REF!,#REF!,#REF!,#REF!,#REF!,#REF!,#REF!,#REF!,#REF!,#REF!,#REF!,#REF!,#REF!,#REF!,#REF!,#REF!,#REF!,#REF!,#REF!,#REF!,#REF!,#REF!,#REF!,#REF!,#REF!,#REF!,#REF!,#REF!,#REF!,#REF!,#REF!,#REF!,#REF!,#REF!,#REF!,#REF!,#REF!,#REF!,#REF!,#REF!)","v":{"$error":"#REF!"}},{"$error":"#REF!"},null,{"$f":"SUM(#REF!)","v":{"$error":"#REF!"}},{"$f":"SUM(#REF!,#REF!,#REF!,#REF!,#REF!,#REF!,#REF!,#REF!,#REF!,#REF!,#REF!,#REF!)","v":{"$error":"#REF!"}},{"$f":"SUM(#REF!)","v":{"$error":"#REF!"}},{"$f":"SUM(#REF!,#REF!,#REF!,#REF!,#REF!)","v":{"$error":"#REF!"}},{"$error":"#REF!"},null,0,0,0,0,0,null,0,0,0,0,0,null,"AS26:AX27","Per Diem Cost"]
[null,"Service Truck Mileage Cost",null,{"$error":"#REF!"},{"$error":"#REF!"},{"$error":"#REF!"},{"$error":"#REF!"},{"$error":"#REF!"},{"$error":"#REF!"},{"$f":"SUM(#REF!,#REF!,#REF!)","v":{"$error":"#REF!"}},0,{"$f":"SUM(#REF!,#REF!,#REF!,#REF!,#REF!,#REF!,#REF!,#REF!,#REF!,#REF!,#REF!,#REF!,#REF!,#REF!)","v":{"$error":"#REF!"}},0,{"$error":"#REF!"},null,{"$f":"SUM(#REF!,#REF!,#REF!,#REF!,#REF!,#REF!,#REF!)","v":{"$error":"#REF!"}},{"$f":"SUM(#REF!,#REF!,#REF!,#REF!,#REF!,#REF!,#REF!,#REF!,#REF!)","v":{"$error":"#REF!"}},{"$f":"SUM(#REF!,#REF!,#REF!,#REF!,#REF!,#REF!,#REF!,#REF!,#REF!)","v":{"$error":"#REF!"}},0,{"$error":"#REF!"},null,{"$f":"SUM(#REF!,#REF!,#REF!,#REF!,#REF!,#REF!,#REF!,#REF!)","v":{"$error":"#REF!"}},{"$f":"SUM(#REF!,#REF!,#REF!,#REF!,#REF!,#REF!,#REF!,#REF!,#REF!,#REF!,#REF!)","v":{"$error":"#REF!"}},{"$f":"SUM(#REF!,#REF!,#REF!,#REF!,#REF!)","v":{"$error":"#REF!"}},{"$f":"SUM(#REF!,#REF!,#REF!,#REF!,#REF!)","v":{"$error":"#REF!"}},{"$error":"#REF!"},null,{"$f":"SUM(#REF!,#REF!,#REF!,#REF!,#REF!,#REF!,#REF!,#REF!,#REF!)","v":{"$error":"#REF!"}},{"$f":"SUM(#REF!,#REF!)","v":{"$error":"#REF!"}},{"$f":"SUM(#REF!)","v":{"$error":"#REF!"}},{"$f":"SUM(#REF!,#REF!,#REF!,#REF!,#REF!,#REF!,#REF!,#REF!,#REF!,#REF!,#REF!,#REF!,#REF!,#REF!,#REF!,#REF!,#REF!,#REF!,#REF!,#REF!,#REF!,#REF!,#REF!,#REF!,#REF!,#REF!,#REF!,#REF!,#REF!,#REF!,#REF!,#REF!,#REF!,#REF!,#REF!,#REF!,#REF!,#REF!,#REF!,#REF!,#REF!,#REF!,#REF!)","v":{"$error":"#REF!"}},{"$error":"#REF!"},null,{"$f":"SUM(#REF!)","v":{"$error":"#REF!"}},{"$f":"SUM(#REF!,#REF!,#REF!,#REF!,#REF!,#REF!,#REF!,#REF!,#REF!,#REF!,#REF!,#REF!)","v":{"$error":"#REF!"}},{"$f":"SUM(#REF!)","v":{"$error":"#REF!"}},{"$f":"SUM(#REF!,#REF!,#REF!,#REF!,#REF!)","v":{"$error":"#REF!"}},{"$error":"#REF!"},null,0,0,0,0,0,null,0,0,0,0,0,null,"AS28:AX29","Service Truck Mileage Cost"]
[null,"Relief Travel Cost & Other Special Charges",null,{"$error":"#REF!"},{"$error":"#REF!"},{"$error":"#REF!"},{"$error":"#REF!"},{"$error":"#REF!"},0,{"$f":"SUM(#REF!,#REF!,#REF!)","v":{"$error":"#REF!"}},0,{"$f":"SUM(#REF!,#REF!,#REF!,#REF!,#REF!,#REF!,#REF!,#REF!,#REF!,#REF!,#REF!,#REF!,#REF!,#REF!)","v":{"$error":"#REF!"}},0,{"$error":"#REF!"},null,{"$f":"SUM(#REF!,#REF!,#REF!,#REF!,#REF!,#REF!,#REF!)","v":{"$error":"#REF!"}},{"$f":"SUM(#REF!,#REF!,#REF!,#REF!,#REF!,#REF!,#REF!,#REF!,#REF!)","v":{"$error":"#REF!"}},{"$f":"SUM(#REF!,#REF!,#REF!,#REF!,#REF!,#REF!,#REF!,#REF!,#REF!)","v":{"$error":"#REF!"}},0,{"$error":"#REF!"},null,{"$f":"SUM(#REF!,#REF!,#REF!,#REF!,#REF!,#REF!,#REF!,#REF!)","v":{"$error":"#REF!"}},{"$f":"SUM(#REF!,#REF!,#REF!,#REF!,#REF!,#REF!,#REF!,#REF!,#REF!,#REF!,#REF!)","v":{"$error":"#REF!"}},{"$f":"SUM(#REF!,#REF!,#REF!,#REF!,#REF!)","v":{"$error":"#REF!"}},{"$f":"SUM(#REF!,#REF!,#REF!,#REF!,#REF!)","v":{"$error":"#REF!"}},{"$error":"#REF!"},null,{"$f":"SUM(#REF!,#REF!,#REF!,#REF!,#REF!,#REF!,#REF!,#REF!,#REF!)","v":{"$error":"#REF!"}},{"$f":"SUM(#REF!,#REF!)","v":{"$error":"#REF!"}},{"$f":"SUM(#REF!)","v":{"$error":"#REF!"}},{"$f":"SUM(#REF!,#REF!,#REF!,#REF!,#REF!,#REF!,#REF!,#REF!,#REF!,#REF!,#REF!,#REF!,#REF!,#REF!,#REF!,#REF!,#REF!,#REF!,#REF!,#REF!,#REF!,#REF!,#REF!,#REF!,#REF!,#REF!,#REF!,#REF!,#REF!,#REF!,#REF!,#REF!,#REF!,#REF!,#REF!,#REF!,#REF!,#REF!,#REF!,#REF!,#REF!,#REF!,#REF!)","v":{"$error":"#REF!"}},{"$error":"#REF!"},null,{"$f":"SUM(#REF!)","v":{"$error":"#REF!"}},{"$f":"SUM(#REF!,#REF!,#REF!,#REF!,#REF!,#REF!,#REF!,#REF!,#REF!,#REF!,#REF!,#REF!)","v":{"$error":"#REF!"}},{"$f":"SUM(#REF!)","v":{"$error":"#REF!"}},{"$f":"SUM(#REF!,#REF!,#REF!,#REF!,#REF!)","v":{"$error":"#REF!"}},{"$error":"#REF!"},null,0,0,0,0,0,null,0,0,0,0,0,null,"AS32:AX37","Relief Travel Cost & Other Special Charges"]
[null,"Passengers transported",null,{"$error":"#REF!"},{"$error":"#REF!"},{"$error":"#REF!"},{"$error":"#REF!"},{"$error":"#REF!"},{"$error":"#REF!"},{"$f":"SUM(#REF!,#REF!,#REF!)","v":{"$error":"#REF!"}},0,{"$f":"SUM(#REF!,#REF!,#REF!,#REF!,#REF!,#REF!,#REF!,#REF!,#REF!,#REF!,#REF!,#REF!,#REF!,#REF!)","v":{"$error":"#REF!"}},0,{"$error":"#REF!"},null,{"$f":"SUM(#REF!,#REF!,#REF!,#REF!,#REF!,#REF!,#REF!)","v":{"$error":"#REF!"}},{"$f":"SUM(#REF!,#REF!,#REF!,#REF!,#REF!,#REF!,#REF!,#REF!,#REF!)","v":{"$error":"#REF!"}},{"$f":"SUM(#REF!,#REF!,#REF!,#REF!,#REF!,#REF!,#REF!,#REF!,#REF!)","v":{"$error":"#REF!"}},0,{"$error":"#REF!"},null,{"$f":"SUM(#REF!,#REF!,#REF!,#REF!,#REF!,#REF!,#REF!,#REF!)","v":{"$error":"#REF!"}},{"$f":"SUM(#REF!,#REF!,#REF!,#REF!,#REF!,#REF!,#REF!,#REF!,#REF!,#REF!,#REF!)","v":{"$error":"#REF!"}},{"$f":"SUM(#REF!,#REF!,#REF!,#REF!,#REF!)","v":{"$error":"#REF!"}},{"$f":"SUM(#REF!,#REF!,#REF!,#REF!,#REF!)","v":{"$error":"#REF!"}},{"$error":"#REF!"},null,{"$f":"SUM(#REF!,#REF!,#REF!,#REF!,#REF!,#REF!,#REF!,#REF!,#REF!)","v":{"$error":"#REF!"}},{"$f":"SUM(#REF!,#REF!)","v":{"$error":"#REF!"}},{"$f":"SUM(#REF!)","v":{"$error":"#REF!"}},{"$f":"SUM(#REF!,#REF!,#REF!,#REF!,#REF!,#REF!,#REF!,#REF!,#REF!,#REF!,#REF!,#REF!,#REF!,#REF!,#REF!,#REF!,#REF!,#REF!,#REF!,#REF!,#REF!,#REF!,#REF!,#REF!,#REF!,#REF!,#REF!,#REF!,#REF!,#REF!,#REF!,#REF!,#REF!,#REF!,#REF!,#REF!,#REF!,#REF!,#REF!,#REF!,#REF!,#REF!,#REF!)","v":{"$error":"#REF!"}},{"$error":"#REF!"},null,{"$f":"SUM(#REF!)","v":{"$error":"#REF!"}},{"$f":"SUM(#REF!,#REF!,#REF!,#REF!,#REF!,#REF!,#REF!,#REF!,#REF!,#REF!,#REF!,#REF!)","v":{"$error":"#REF!"}},{"$f":"SUM(#REF!)","v":{"$error":"#REF!"}},{"$f":"SUM(#REF!,#REF!,#REF!,#REF!,#REF!)","v":{"$error":"#REF!"}},{"$error":"#REF!"},null,0,0,0,0,0,null,0,0,0,0,0,null,"V43:Z44","Passengers Transported"]
[null,"Cargo transported (lbs.)",null,{"$error":"#REF!"},{"$error":"#REF!"},{"$error":"#REF!"},{"$error":"#REF!"},{"$error":"#REF!"},{"$error":"#REF!"},{"$f":"SUM(#REF!,#REF!,#REF!)","v":{"$error":"#REF!"}},0,{"$f":"SUM(#REF!,#REF!,#REF!,#REF!,#REF!,#REF!,#REF!,#REF!,#REF!,#REF!,#REF!,#REF!,#REF!,#REF!)","v":{"$error":"#REF!"}},0,{"$error":"#REF!"},null,{"$f":"SUM(#REF!,#REF!,#REF!,#REF!,#REF!,#REF!,#REF!)","v":{"$error":"#REF!"}},{"$f":"SUM(#REF!,#REF!,#REF!,#REF!,#REF!,#REF!,#REF!,#REF!,#REF!)","v":{"$error":"#REF!"}},{"$f":"SUM(#REF!,#REF!,#REF!,#REF!,#REF!,#REF!,#REF!,#REF!,#REF!)","v":{"$error":"#REF!"}},0,{"$error":"#REF!"},null,{"$f":"SUM(#REF!,#REF!,#REF!,#REF!,#REF!,#REF!,#REF!,#REF!)","v":{"$error":"#REF!"}},{"$f":"SUM(#REF!,#REF!,#REF!,#REF!,#REF!,#REF!,#REF!,#REF!,#REF!,#REF!,#REF!)","v":{"$error":"#REF!"}},{"$f":"SUM(#REF!,#REF!,#REF!,#REF!,#REF!)","v":{"$error":"#REF!"}},{"$f":"SUM(#REF!,#REF!,#REF!,#REF!,#REF!)","v":{"$error":"#REF!"}},{"$error":"#REF!"},null,{"$f":"SUM(#REF!,#REF!,#REF!,#REF!,#REF!,#REF!,#REF!,#REF!,#REF!)","v":{"$error":"#REF!"}},{"$f":"SUM(#REF!,#REF!)","v":{"$error":"#REF!"}},{"$f":"SUM(#REF!)","v":{"$error":"#REF!"}},{"$f":"SUM(#REF!,#REF!,#REF!,#REF!,#REF!,#REF!,#REF!,#REF!,#REF!,#REF!,#REF!,#REF!,#REF!,#REF!,#REF!,#REF!,#REF!,#REF!,#REF!,#REF!,#REF!,#REF!,#REF!,#REF!,#REF!,#REF!,#REF!,#REF!,#REF!,#REF!,#REF!,#REF!,#REF!,#REF!,#REF!,#REF!,#REF!,#REF!,#REF!,#REF!,#REF!,#REF!,#REF!)","v":{"$error":"#REF!"}},{"$error":"#REF!"},null,{"$f":"SUM(#REF!)","v":{"$error":"#REF!"}},{"$f":"SUM(#REF!,#REF!,#REF!,#REF!,#REF!,#REF!,#REF!,#REF!,#REF!,#REF!,#REF!,#REF!)","v":{"$error":"#REF!"}},{"$f":"SUM(#REF!)","v":{"$error":"#REF!"}},{"$f":"SUM(#REF!,#REF!,#REF!,#REF!,#REF!)","v":{"$error":"#REF!"}},{"$error":"#REF!"},null,0,0,0,0,0,null,0,0,0,0,0,null,"AA43:AF44","Cargo Transported (lbs.)"]
[null,"Water dropped (gal.)",null,null,null,null,{"$f":"SUM(M16,S16,Y16,AE16,AK16,AQ16,AW16)","v":{"$error":"#REF!"}},{"$error":"#REF!"},{"$error":"#REF!"},null,null,null,0,0,null,null,null,null,0,0,null,null,null,null,{"$f":"SUM(#REF!,#REF!,#REF!,#REF!,#REF!)","v":{"$error":"#REF!"}},{"$error":"#REF!"},null,null,null,null,{"$f":"SUM(#REF!,#REF!,#REF!,#REF!,#REF!,#REF!,#REF!,#REF!,#REF!,#REF!,#REF!,#REF!,#REF!,#REF!,#REF!,#REF!,#REF!,#REF!,#REF!,#REF!,#REF!,#REF!,#REF!,#REF!,#REF!,#REF!,#REF!,#REF!,#REF!,#REF!,#REF!,#REF!,#REF!,#REF!,#REF!,#REF!,#REF!,#REF!,#REF!,#REF!,#REF!,#REF!,#REF!)","v":{"$error":"#REF!"}},{"$error":"#REF!"},null,null,null,null,{"$f":"SUM(#REF!,#REF!,#REF!,#REF!,#REF!)","v":{"$error":"#REF!"}},{"$error":"#REF!"},null,null,null,null,0,0,null,null,null,null,0,0,null,"AG43:AL44","Water Dropped (gal.)"]
[null,"Initial Attacks",null,null,null,null,{"$f":"SUM(M17,S17,Y17,AE17,AK17,AQ17,AW17)","v":1},1,1,null,null,null,0,{"$f":"M17","v":0},null,null,null,null,0,0,null,null,null,null,1,1,null,null,null,null,0,0,null,null,null,null,0,0,null,null,null,null,0,0,null,null,null,null,0,0,null,null,"Initial Attacks"]
[null,"SARs, Projects, Training & Fires Supported",null,{"$f":"SUM(J18,P18,V18,AB18,AH18,AN18,AT18)-2","v":23},{"$f":"SUM(K18,Q18,W18,AC18,AI18,AO18,AU18)","v":13},{"$f":"SUM(L18,R18,X18,AD18,AJ18,AP18,AV18)","v":28},{"$f":"SUM(M18,S18,Y18,AE18,AK18,)","v":10},null,0,{"$f":"J43+J63+J83+J103+J125","v":3},{"$f":"K43+K63+K83+K103+K125","v":0},{"$f":"L43+L63+L83+L103+L125","v":14},{"$f":"M43+M63+M83+M103+M125","v":0},null,null,{"$f":"P43+P63+P83+P103+P125","v":5},{"$f":"Q43+Q63+Q83+Q103+Q125","v":3},{"$f":"R43+R63+R83+R103+R125","v":7},{"$f":"S43+S63+S83+S103+S125","v":0},null,null,{"$f":"V43+V63+V83+V103+V125","v":7},{"$f":"W43+W63+W83+W103+W125","v":4},{"$f":"X43+X63+X83+X103+X125","v":5},{"$f":"Y43+Y63+Y83+Y103+Y125","v":2},null,null,{"$f":"AB43+AB63+AB83+AB103+AB125","v":9},{"$f":"AC43+AC63+AC83+AC103+AC125","v":1},{"$f":"AD43+AD63+AD83+AD103+AD125","v":1},{"$f":"AE43+AE63+AE83+AE103+AE125","v":5},null,null,{"$f":"AH43+AH63+AH83+AH103+AH125","v":1},{"$f":"AI43+AI63+AI83+AI103+AI125","v":5},{"$f":"AJ43+AJ63+AJ83+AJ103+AJ125","v":1},{"$f":"AK43+AK63+AK83+AK103+AK125","v":3},null,null,{"$f":"AN43+AN63+AN83+AN103+AN125","v":0},{"$f":"AO43+AO63+AO83+AO103+AO125","v":0},{"$f":"AP43+AP63+AP83+AP103+AP125","v":0},{"$f":"AQ43+AQ63+AQ83+AQ103+AQ125","v":0},null,null,{"$f":"AT43+AT63+AT83+AT103+AT125","v":0},{"$f":"AU43+AU63+AU83+AU103+AU125","v":0},{"$f":"AV43+AV63+AV83+AV103+AV125","v":0},{"$f":"AW43+AW63+AW83+AW103+AW125","v":0},null,null,null,"SARs, Projects, Training & Fires Supported"]
[null,"Wilderness Fight Time Hours",null,{"$f":"SUM(J19,P19,V19,AB19,AH19,AN19,AT19)","v":{"$error":"#REF!"}},{"$error":"#REF!"},{"$error":"#REF!"},{"$error":"#REF!"},{"$f":"SUM(D19:G19)","v":{"$error":"#REF!"}},null,{"$f":"SUM(#REF!,#REF!,#REF!)","v":{"$error":"#REF!"}},0,{"$f":"SUM(#REF!,#REF!,#REF!,#REF!,#REF!,#REF!,#REF!,#REF!,#REF!,#REF!,#REF!,#REF!,#REF!,#REF!)","v":{"$error":"#REF!"}},0,{"$f":"SUM(J19:M19)","v":{"$error":"#REF!"}},null,{"$f":"SUM(#REF!,#REF!,#REF!,#REF!,#REF!,#REF!,#REF!)","v":{"$error":"#REF!"}},{"$f":"SUM(#REF!,#REF!,#REF!,#REF!,#REF!,#REF!,#REF!,#REF!,#REF!)","v":{"$error":"#REF!"}},{"$f":"SUM(#REF!,#REF!,#REF!,#REF!,#REF!,#REF!,#REF!,#REF!,#REF!)","v":{"$error":"#REF!"}},0,{"$f":"SUM(P19:S19)","v":{"$error":"#REF!"}},null,{"$f":"SUM(#REF!,#REF!,#REF!,#REF!,#REF!,#REF!,#REF!,#REF!)","v":{"$error":"#REF!"}},{"$f":"SUM(#REF!,#REF!,#REF!,#REF!,#REF!,#REF!,#REF!,#REF!,#REF!,#REF!,#REF!)","v":{"$error":"#REF!"}},{"$f":"SUM(#REF!,#REF!,#REF!,#REF!,#REF!)","v":{"$error":"#REF!"}},{"$f":"SUM(#REF!,#REF!,#REF!,#REF!,#REF!)","v":{"$error":"#REF!"}},{"$f":"SUM(V19:Y19)","v":{"$error":"#REF!"}},null,{"$f":"SUM(#REF!,#REF!,#REF!,#REF!,#REF!,#REF!,#REF!,#REF!,#REF!)","v":{"$error":"#REF!"}},{"$f":"SUM(#REF!,#REF!)","v":{"$error":"#REF!"}},{"$f":"SUM(#REF!)","v":{"$error":"#REF!"}},{"$f":"SUM(#REF!,#REF!,#REF!,#REF!,#REF!,#REF!,#REF!,#REF!,#REF!,#REF!,#REF!,#REF!,#REF!,#REF!,#REF!,#REF!,#REF!,#REF!,#REF!,#REF!,#REF!,#REF!,#REF!,#REF!,#REF!,#REF!,#REF!,#REF!,#REF!,#REF!,#REF!,#REF!,#REF!,#REF!,#REF!,#REF!,#REF!,#REF!,#REF!,#REF!,#REF!,#REF!,#REF!)","v":{"$error":"#REF!"}},{"$f":"SUM(AB19:AE19)","v":{"$error":"#REF!"}},null,{"$f":"SUM(#REF!)","v":{"$error":"#REF!"}},{"$f":"SUM(#REF!,#REF!,#REF!,#REF!,#REF!,#REF!,#REF!,#REF!,#REF!,#REF!,#REF!,#REF!)","v":{"$error":"#REF!"}},{"$f":"SUM(#REF!)","v":{"$error":"#REF!"}},{"$f":"SUM(#REF!,#REF!,#REF!,#REF!,#REF!)","v":{"$error":"#REF!"}},{"$f":"SUM(AH19:AK19)","v":{"$error":"#REF!"}},null,0,0,0,0,{"$f":"SUM(AN19:AQ19)","v":0},null,0,0,0,0,{"$f":"SUM(AT19:AW19)","v":0},null,"BN18:BP19","Wilderness Fight Time Hours"]
[null,"Wilderness Landings",null,{"$error":"#REF!"},{"$error":"#REF!"},{"$error":"#REF!"},{"$error":"#REF!"},{"$f":"SUM(D20:G20)","v":{"$error":"#REF!"}},null,{"$f":"SUM(#REF!,#REF!,#REF!)","v":{"$error":"#REF!"}},0,{"$f":"SUM(#REF!,#REF!,#REF!,#REF!,#REF!,#REF!,#REF!,#REF!,#REF!,#REF!,#REF!,#REF!,#REF!,#REF!)","v":{"$error":"#REF!"}},0,{"$f":"SUM(J20:M20)","v":{"$error":"#REF!"}},null,{"$f":"SUM(#REF!,#REF!,#REF!,#REF!,#REF!,#REF!,#REF!)","v":{"$error":"#REF!"}},{"$f":"SUM(#REF!,#REF!,#REF!,#REF!,#REF!,#REF!,#REF!,#REF!,#REF!)","v":{"$error":"#REF!"}},{"$f":"SUM(#REF!,#REF!,#REF!,#REF!,#REF!,#REF!,#REF!,#REF!,#REF!)","v":{"$error":"#REF!"}},0,{"$f":"SUM(P20:S20)","v":{"$error":"#REF!"}},null,{"$f":"SUM(#REF!,#REF!,#REF!,#REF!,#REF!,#REF!,#REF!,#REF!)","v":{"$error":"#REF!"}},{"$f":"SUM(#REF!,#REF!,#REF!,#REF!,#REF!,#REF!,#REF!,#REF!,#REF!,#REF!,#REF!)","v":{"$error":"#REF!"}},{"$f":"SUM(#REF!,#REF!,#REF!,#REF!,#REF!)","v":{"$error":"#REF!"}},{"$f":"SUM(#REF!,#REF!,#REF!,#REF!,#REF!)","v":{"$error":"#REF!"}},{"$f":"SUM(V20:Y20)","v":{"$error":"#REF!"}},null,{"$f":"SUM(#REF!,#REF!,#REF!,#REF!,#REF!,#REF!,#REF!,#REF!,#REF!)","v":{"$error":"#REF!"}},{"$f":"SUM(#REF!,#REF!)","v":{"$error":"#REF!"}},{"$f":"SUM(#REF!)","v":{"$error":"#REF!"}},{"$f":"SUM(#REF!,#REF!,#REF!,#REF!,#REF!,#REF!,#REF!,#REF!,#REF!,#REF!,#REF!,#REF!,#REF!,#REF!,#REF!,#REF!,#REF!,#REF!,#REF!,#REF!,#REF!,#REF!,#REF!,#REF!,#REF!,#REF!,#REF!,#REF!,#REF!,#REF!,#REF!,#REF!,#REF!,#REF!,#REF!,#REF!,#REF!,#REF!,#REF!,#REF!,#REF!,#REF!,#REF!)","v":{"$error":"#REF!"}},{"$f":"SUM(AB20:AE20)","v":{"$error":"#REF!"}},null,{"$f":"SUM(#REF!)","v":{"$error":"#REF!"}},{"$f":"SUM(#REF!,#REF!,#REF!,#REF!,#REF!,#REF!,#REF!,#REF!,#REF!,#REF!,#REF!,#REF!)","v":{"$error":"#REF!"}},{"$f":"SUM(#REF!)","v":{"$error":"#REF!"}},{"$f":"SUM(#REF!,#REF!,#REF!,#REF!,#REF!)","v":{"$error":"#REF!"}},{"$f":"SUM(AH20:AK20)","v":{"$error":"#REF!"}},null,0,0,0,0,{"$f":"SUM(AN20:AQ20)","v":0},null,0,0,0,0,{"$f":"SUM(AT20:AW20)","v":0},null,"BN20:BP21","Wilderness Landings"]
[null,"Wilderness Deliveries"," ",{"$error":"#REF!"},{"$error":"#REF!"},{"$error":"#REF!"},{"$error":"#REF!"},{"$f":"SUM(D21:G21)","v":{"$error":"#REF!"}},null,{"$f":"SUM(#REF!,#REF!,#REF!)","v":{"$error":"#REF!"}},0,{"$f":"SUM(#REF!,#REF!,#REF!,#REF!,#REF!,#REF!,#REF!,#REF!,#REF!,#REF!,#REF!,#REF!,#REF!,#REF!)","v":{"$error":"#REF!"}},0,{"$f":"SUM(J21:M21)","v":{"$error":"#REF!"}},null,{"$f":"SUM(#REF!,#REF!,#REF!,#REF!,#REF!,#REF!,#REF!)","v":{"$error":"#REF!"}},{"$f":"SUM(#REF!,#REF!,#REF!,#REF!,#REF!,#REF!,#REF!,#REF!,#REF!)","v":{"$error":"#REF!"}},{"$f":"SUM(#REF!,#REF!,#REF!,#REF!,#REF!,#REF!,#REF!,#REF!,#REF!)","v":{"$error":"#REF!"}},0,{"$f":"SUM(P21:S21)","v":{"$error":"#REF!"}},null,{"$f":"SUM(#REF!,#REF!,#REF!,#REF!,#REF!,#REF!,#REF!,#REF!)","v":{"$error":"#REF!"}},{"$f":"SUM(#REF!,#REF!,#REF!,#REF!,#REF!,#REF!,#REF!,#REF!,#REF!,#REF!,#REF!)","v":{"$error":"#REF!"}},{"$f":"SUM(#REF!,#REF!,#REF!,#REF!,#REF!)","v":{"$error":"#REF!"}},{"$f":"SUM(#REF!,#REF!,#REF!,#REF!,#REF!)","v":{"$error":"#REF!"}},{"$f":"SUM(V21:Y21)","v":{"$error":"#REF!"}},null,{"$f":"SUM(#REF!,#REF!,#REF!,#REF!,#REF!,#REF!,#REF!,#REF!,#REF!)","v":{"$error":"#REF!"}},{"$f":"SUM(#REF!,#REF!)","v":{"$error":"#REF!"}},{"$f":"SUM(#REF!)","v":{"$error":"#REF!"}},{"$f":"SUM(#REF!,#REF!,#REF!,#REF!,#REF!,#REF!,#REF!,#REF!,#REF!,#REF!,#REF!,#REF!,#REF!,#REF!,#REF!,#REF!,#REF!,#REF!,#REF!,#REF!,#REF!,#REF!,#REF!,#REF!,#REF!,#REF!,#REF!,#REF!,#REF!,#REF!,#REF!,#REF!,#REF!,#REF!,#REF!,#REF!,#REF!,#REF!,#REF!,#REF!,#REF!,#REF!,#REF!)","v":{"$error":"#REF!"}},{"$f":"SUM(AB21:AE21)","v":{"$error":"#REF!"}},null,{"$f":"SUM(#REF!)","v":{"$error":"#REF!"}},{"$f":"SUM(#REF!,#REF!,#REF!,#REF!,#REF!,#REF!,#REF!,#REF!,#REF!,#REF!,#REF!,#REF!)","v":{"$error":"#REF!"}},{"$f":"SUM(#REF!)","v":{"$error":"#REF!"}},{"$f":"SUM(#REF!,#REF!,#REF!,#REF!,#REF!)","v":{"$error":"#REF!"}},{"$f":"SUM(AH21:AK21)","v":{"$error":"#REF!"}},null,0,0,0,0,{"$f":"SUM(AN21:AQ21)","v":0},null,0,0,0,0,{"$f":"SUM(AT21:AW21)","v":0},null,"BN22:BP23","Wilderness Ext. Load Deliveries & Pickups"]
[]
[null,"Totals by unit","All Units","MORA","NOCA","OLYM","USFS/OWF","Other"]
[null,"Days (or partial days) at each unit",null,{"$f":"SUM('Task Order Totals'!AL5)","v":99},{"$f":"SUM('Task Order Totals'!AM5)","v":55},{"$f":"SUM('Task Order Totals'!AN5)","v":8},{"$f":"SUM('Task Order Totals'!AO5)","v":9},{"$f":"SUM('Task Order Totals'!AP5)","v":0}]
[null,"SARs involving short-haul at each Unit",{"$f":"SUM(D25:H25)","v":12},4,5,3,0,0]
[null,"check figures"]
[]
[null,null,{"$f":"$B29","v":"MOUNT RAINIER NP"},null,null,null,null,null,{"$f":"$B29","v":"MOUNT RAINIER NP"},null,null,null,null,null,{"$f":"$B29","v":"MOUNT RAINIER NP"},null,null,null,null,null,{"$f":"$B29","v":"MOUNT RAINIER NP"},null,null,null,null,null,{"$f":"$B29","v":"MOUNT RAINIER NP"},null,null,null,null,null,{"$f":"$B29","v":"MOUNT RAINIER NP"},null,null,null,null,null,{"$f":"$B29","v":"MOUNT RAINIER NP"},null,null,null,null,null,{"$f":"$B29","v":"MOUNT RAINIER NP"}]
[null,"MOUNT RAINIER NP",{"$f":"C2","v":"139-day Contract TOTALS"},null,null,null,null,null,"May",null,null,null,null,null,"June",null,null,null,null,null,"July",null,null,null,null,null,"August",null,null,null,null,null,"September",null,null,null,null,null,"October",null,null,null,null,null,"November"]
[null,null,null,"SAR","Project","Training","Fire","Total","Availability","SAR","Project","Training","Fire","Total","Availability","SAR (operational)","Project","Training","Fire","Total","Availability","SAR (operational)","Project","Training","Fire","Total","Availability","SAR (operational)","Project","Training","Fire","Total","Availability","SAR (operational)","Project","Training","Fire","Total","Availability","SAR (operational)","Project","Training","Fire","Total","Availability","SAR (operational)","Project","Training","Fire","Total"]
[null,"Total Cost",null,{"$f":"SUM(J31,P31,V31,AB31,AH31,AN31,AT31)","v":{"$error":"#REF!"}},{"$f":"SUM(K31,Q31,W31,AC31,AI31,AO31,AU31)","v":{"$error":"#REF!"}},{"$f":"SUM(L31,R31,X31,AD31,AJ31,AP31,AV31)","v":{"$error":"#REF!"}},{"$f":"SUM(M31,S31,Y31,AE31,AK31,AQ31,AW31)","v":0},{"$f":"SUM(N31,T31,Z31,AF31,AL31,AR31,AX31)","v":{"$error":"#REF!"}},null,{"$f":"J34+J35+J36+J37+J38","v":{"$error":"#REF!"}},{"$f":"K34+K35+K36+K37+K38","v":0},{"$f":"L34+L35+L36+L37+L38","v":{"$error":"#REF!"}},{"$f":"M34+M35+M36+M37+M38","v":0},{"$f":"SUM(I31:M31)","v":{"$error":"#REF!"}},null,{"$f":"P34+P35+P36+P37+P38","v":{"$error":"#REF!"}},{"$f":"Q34+Q35+Q36+Q37+Q38","v":{"$error":"#REF!"}},{"$f":"R34+R35+R36+R37+R38","v":{"$error":"#REF!"}},{"$f":"S34+S35+S36+S37+S38","v":0},{"$f":"SUM(O31:S31)","v":{"$error":"#REF!"}},null,{"$f":"V34+V35+V36+V37+V38","v":{"$error":"#REF!"}},{"$f":"W34+W35+W36+W37+W38","v":{"$error":"#REF!"}},{"$f":"X34+X35+X36+X37+X38","v":{"$error":"#REF!"}},{"$f":"Y34+Y35+Y36+Y37+Y38","v":0},{"$f":"SUM(U31:Y31)","v":{"$error":"#REF!"}},null,{"$f":"AB34+AB35+AB36+AB37+AB38","v":{"$error":"#REF!"}},{"$f":"AC34+AC35+AC36+AC37+AC38","v":0},{"$f":"AD34+AD35+AD36+AD37+AD38","v":{"$error":"#REF!"}},{"$f":"AE34+AE35+AE36+AE37+AE38","v":0},{"$f":"SUM(AA31:AE31)","v":{"$error":"#REF!"}},null,{"$f":"AH34+AH35+AH36+AH37+AH38","v":{"$error":"#REF!"}},{"$f":"AI34+AI35+AI36+AI37+AI38","v":{"$error":"#REF!"}},{"$f":"AJ34+AJ35+AJ36+AJ37+AJ38","v":{"$error":"#REF!"}},{"$f":"AK34+AK35+AK36+AK37+AK38","v":0},{"$f":"SUM(AG31:AK31)","v":{"$error":"#REF!"}},null,{"$f":"AN34+AN35+AN36+AN37+AN38","v":0},{"$f":"AO34+AO35+AO36+AO37+AO38","v":0},{"$f":"AP34+AP35+AP36+AP37+AP38","v":0},{"$f":"AQ34+AQ35+AQ36+AQ37+AQ38","v":0},{"$f":"SUM(AM31:AQ31)","v":0},null,{"$f":"AT34+AT35+AT36+AT37+AT38","v":0},{"$f":"AU34+AU35+AU36+AU37+AU38","v":0},{"$f":"AV34+AV35+AV36+AV37+AV38","v":0},{"$f":"AW34+AW35+AW36+AW37+AW38","v":0},{"$f":"SUM(AS31:AW31)","v":0},null,null,"Total Cost"]
[null,"Flight Time Hours",null,{"$f":"SUM(J32,P32,V32,AB32,AH32,AN32,AT32)","v":{"$error":"#REF!"}},{"$f":"SUM(K32,Q32,W32,AC32,AI32,AO32,AU32)","v":{"$error":"#REF!"}},{"$f":"SUM(L32,R32,X32,AD32,AJ32,AP32,AV32)","v":{"$error":"#REF!"}},{"$f":"SUM(M32,S32,Y32,AE32,AK32,AQ32,AW32)","v":0},{"$f":"SUM(D32:G32)","v":{"$error":"#REF!"}},null,{"$f":"SUM(#REF!,#REF!)","v":{"$error":"#REF!"}},0,{"$f":"SUM(#REF!,#REF!,#REF!,#REF!,#REF!,#REF!,#REF!,#REF!,#REF!,#REF!,#REF!)","v":{"$error":"#REF!"}},0,{"$f":"SUM(J32:M32)","v":{"$error":"#REF!"}},null,{"$f":"SUM(#REF!,#REF!)","v":{"$error":"#REF!"}},{"$f":"SUM(#REF!,#REF!,#REF!,#REF!)","v":{"$error":"#REF!"}},{"$f":" SUM(#REF!,#REF!,#REF!,#REF!)","v":{"$error":"#REF!"}},0,{"$f":"SUM(P32:S32)","v":{"$error":"#REF!"}},null,{"$f":"SUM(#REF!,#REF!,#REF!,#REF!)","v":{"$error":"#REF!"}},{"$f":"SUM(#REF!,#REF!,#REF!,#REF!,#REF!,#REF!,#REF!,#REF!,#REF!,#REF!,#REF!)","v":{"$error":"#REF!"}},{"$f":"SUM(#REF!,#REF!,#REF!,#REF!,#REF!)","v":{"$error":"#REF!"}},0,{"$f":"SUM(V32:Y32)","v":{"$error":"#REF!"}},null,{"$f":"SUM(#REF!,#REF!,#REF!,#REF!)","v":{"$error":"#REF!"}},0,{"$f":"SUM(#REF!)","v":{"$error":"#REF!"}},0,{"$f":"SUM(AB32:AE32)","v":{"$error":"#REF!"}},null,{"$f":"SUM(#REF!)","v":{"$error":"#REF!"}},{"$f":"SUM(#REF!,#REF!,#REF!,#REF!,#REF!,#REF!,#REF!,#REF!)","v":{"$error":"#REF!"}},{"$f":"SUM(#REF!)","v":{"$error":"#REF!"}},0,{"$f":"SUM(AH32:AK32)","v":{"$error":"#REF!"}},null,0,0,0,0,{"$f":"SUM(AN32:AQ32)","v":0},null,0,0,0,0,{"$f":"SUM(AT32:AW32)","v":0},null,"AH16:AL17","Flight Time Hours"]
[null,"Flight Time Percentage",null,{"$f":"IF(SUM(D32:G32)=0,0,D32/SUM(D32:G32))","v":{"$error":"#REF!"}},{"$f":"IF(SUM(D32:G32)=0,0,E32/SUM(D32:G32))","v":{"$error":"#REF!"}},{"$f":"IF(SUM(D32:G32)=0,0,F32/SUM(D32:G32))","v":{"$error":"#REF!"}},{"$f":"IF(SUM(D32:G32)=0,0,G32/SUM(D32:G32))","v":{"$error":"#REF!"}},{"$f":"SUM(D33:G33)","v":{"$error":"#REF!"}},null,{"$f":"IF(SUM(J32:M32)=0,0,J32/SUM(J32:M32))","v":{"$error":"#REF!"}},{"$f":"IF(SUM(J32:M32)=0,0,K32/SUM(J32:M32))","v":{"$error":"#REF!"}},{"$f":"IF(SUM(J32:M32)=0,0,L32/SUM(J32:M32))","v":{"$error":"#REF!"}},{"$f":"IF(SUM(J32:M32)=0,0,M32/SUM(J32:M32))","v":{"$error":"#REF!"}},{"$f":"SUM(J33:M33)","v":{"$error":"#REF!"}},null,{"$f":"IF(SUM(P32:S32)=0,0,P32/SUM(P32:S32))","v":{"$error":"#REF!"}},{"$f":"IF(SUM(P32:S32)=0,0,Q32/SUM(P32:S32))","v":{"$error":"#REF!"}},{"$f":"IF(SUM(P32:S32)=0,0,R32/SUM(P32:S32))","v":{"$error":"#REF!"}},{"$f":"IF(SUM(P32:S32)=0,0,S32/SUM(P32:S32))","v":{"$error":"#REF!"}},{"$f":"SUM(P33:S33)","v":{"$error":"#REF!"}},null,{"$f":"IF(SUM(V32:Y32)=0,0,V32/SUM(V32:Y32))","v":{"$error":"#REF!"}},{"$f":"IF(SUM(V32:Y32)=0,0,W32/SUM(V32:Y32))","v":{"$error":"#REF!"}},{"$f":"IF(SUM(V32:Y32)=0,0,X32/SUM(V32:Y32))","v":{"$error":"#REF!"}},{"$f":"IF(SUM(V32:Y32)=0,0,Y32/SUM(V32:Y32))","v":{"$error":"#REF!"}},{"$f":"SUM(V33:Y33)","v":{"$error":"#REF!"}},null,{"$f":"IF(SUM(AB32:AE32)=0,0,AB32/SUM(AB32:AE32))","v":{"$error":"#REF!"}},{"$f":"IF(SUM(AB32:AE32)=0,0,AC32/SUM(AB32:AE32))","v":{"$error":"#REF!"}},{"$f":"IF(SUM(AB32:AE32)=0,0,AD32/SUM(AB32:AE32))","v":{"$error":"#REF!"}},{"$f":"IF(SUM(AB32:AE32)=0,0,AE32/SUM(AB32:AE32))","v":{"$error":"#REF!"}},{"$f":"SUM(AB33:AE33)","v":{"$error":"#REF!"}},null,{"$f":"IF(SUM(AH32:AK32)=0,0,AH32/SUM(AH32:AK32))","v":{"$error":"#REF!"}},{"$f":"IF(SUM(AH32:AK32)=0,0,AI32/SUM(AH32:AK32))","v":{"$error":"#REF!"}},{"$f":"IF(SUM(AH32:AK32)=0,0,AJ32/SUM(AH32:AK32))","v":{"$error":"#REF!"}},{"$f":"IF(SUM(AH32:AK32)=0,0,AK32/SUM(AH32:AK32))","v":{"$error":"#REF!"}},{"$f":"SUM(AH33:AK33)","v":{"$error":"#REF!"}},null,{"$f":"IF(SUM(AN32:AQ32)=0,0,AN32/SUM(AN32:AQ32))","v":0},{"$f":"IF(SUM(AN32:AQ32)=0,0,AO32/SUM(AN32:AQ32))","v":0},{"$f":"IF(SUM(AN32:AQ32)=0,0,AP32/SUM(AN32:AQ32))","v":0},{"$f":"IF(SUM(AN32:AQ32)=0,0,AQ32/SUM(AN32:AQ32))","v":0},0,null,{"$f":"IF(SUM(AT32:AW32)=0,0,AT32/SUM(AT32:AW32))","v":0},{"$f":"IF(SUM(AT32:AW32)=0,0,AU32/SUM(AT32:AW32))","v":0},{"$f":"IF(SUM(AT32:AW32)=0,0,AV32/SUM(AT32:AW32))","v":0},{"$f":"IF(SUM(AT32:AW32)=0,0,AW32/SUM(AT32:AW32))","v":0},0,null,null,"Flight Time Percentage"]
[null,"Flight Time Cost",null,{"$f":"SUM(J34,P34,V34,AB34,AH34,AN34,AT34)","v":{"$error":"#REF!"}},{"$error":"#REF!"},{"$error":"#REF!"},0,{"$f":"SUM(D34:G34)","v":{"$error":"#REF!"}},null,{"$f":"J32*'Contract Info'!$D$18","v":{"$error":"#REF!"}},{"$f":"K32*'Contract Info'!$D$18","v":0},{"$f":"L32*'Contract Info'!$D$18","v":{"$error":"#REF!"}},{"$f":"M32*'Contract Info'!$D$18","v":0},{"$error":"#REF!"},null,{"$f":"P32*'Contract Info'!$D$18","v":{"$error":"#REF!"}},{"$f":"Q32*'Contract Info'!$D$18","v":{"$error":"#REF!"}},{"$f":"R32*'Contract Info'!$D$18","v":{"$error":"#REF!"}},{"$f":"S32*'Contract Info'!$D$18","v":0},{"$f":"SUM(P34:S34)","v":{"$error":"#REF!"}},null,{"$f":"V32*'Contract Info'!$D$18","v":{"$error":"#REF!"}},{"$f":"W32*'Contract Info'!$D$18","v":{"$error":"#REF!"}},{"$f":"X32*'Contract Info'!$D$18","v":{"$error":"#REF!"}},{"$f":"Y32*'Contract Info'!$D$18","v":0},{"$f":"SUM(V34:Y34)","v":{"$error":"#REF!"}},null,{"$f":"AB32*'Contract Info'!$D$18","v":{"$error":"#REF!"}},{"$f":"AC32*'Contract Info'!$D$18","v":0},{"$f":"AD32*'Contract Info'!$D$18","v":{"$error":"#REF!"}},{"$f":"AE32*'Contract Info'!$D$18","v":0},{"$f":"SUM(AB34:AE34)","v":{"$error":"#REF!"}},null,{"$f":"AH32*'Contract Info'!$D$18","v":{"$error":"#REF!"}},{"$f":"AI32*'Contract Info'!$D$18","v":{"$error":"#REF!"}},{"$f":"AJ32*'Contract Info'!$D$18","v":{"$error":"#REF!"}},{"$f":"AK32*'Contract Info'!$D$18","v":0},{"$f":"SUM(AH34:AK34)","v":{"$error":"#REF!"}},null,{"$f":"AN32*'Contract Info'!$D$18","v":0},{"$f":"AO32*'Contract Info'!$D$18","v":0},{"$f":"AP32*'Contract Info'!$D$18","v":0},{"$f":"AQ32*'Contract Info'!$D$18","v":0},{"$f":"SUM(AN34:AQ34)","v":0},null,{"$f":"AT32*'Contract Info'!$D$18","v":0},{"$f":"AU32*'Contract Info'!$D$18","v":0},{"$f":"AV32*'Contract Info'!$D$18","v":0},{"$f":"AW32*'Contract Info'!$D$18","v":0},0,null,null,"Flight Time Cost"]
[null,"Extended Standby Cost",null,{"$error":"#REF!"},{"$error":"#REF!"},{"$error":"#REF!"},0,{"$error":"#REF!"},null,{"$f":"SUM(#REF!,#REF!)","v":{"$error":"#REF!"}},0,{"$f":"SUM(#REF!,#REF!,#REF!,#REF!,#REF!,#REF!,#REF!,#REF!,#REF!,#REF!,#REF!)","v":{"$error":"#REF!"}},0,{"$error":"#REF!"},null,{"$f":"SUM(#REF!,#REF!)","v":{"$error":"#REF!"}},{"$f":"SUM(#REF!,#REF!,#REF!,#REF!)","v":{"$error":"#REF!"}},{"$f":" SUM(#REF!,#REF!,#REF!,#REF!)","v":{"$error":"#REF!"}},0,{"$error":"#REF!"},null,{"$f":"SUM(#REF!,#REF!,#REF!,#REF!)","v":{"$error":"#REF!"}},{"$f":"SUM(#REF!,#REF!,#REF!,#REF!,#REF!,#REF!,#REF!,#REF!,#REF!,#REF!,#REF!)","v":{"$error":"#REF!"}},{"$f":"SUM(#REF!,#REF!,#REF!,#REF!,#REF!)","v":{"$error":"#REF!"}},0,{"$error":"#REF!"},null,{"$f":"SUM(#REF!,#REF!,#REF!,#REF!)","v":{"$error":"#REF!"}},0,{"$f":"SUM(#REF!)","v":{"$error":"#REF!"}},0,{"$error":"#REF!"},null,{"$f":"SUM(#REF!)","v":{"$error":"#REF!"}},{"$f":"SUM(#REF!,#REF!,#REF!,#REF!,#REF!,#REF!,#REF!,#REF!)","v":{"$error":"#REF!"}},{"$f":"SUM(#REF!)","v":{"$error":"#REF!"}},0,{"$error":"#REF!"},null,0,0,0,0,0,null,0,0,0,0,0,null,"AS20:AX25","Extended Standby Cost"]
[null,"Per Diem Cost",null,{"$error":"#REF!"},{"$error":"#REF!"},{"$error":"#REF!"},0,{"$error":"#REF!"},null,{"$f":"SUM(#REF!,#REF!)","v":{"$error":"#REF!"}},0,{"$f":"SUM(#REF!,#REF!,#REF!,#REF!,#REF!,#REF!,#REF!,#REF!,#REF!,#REF!,#REF!)","v":{"$error":"#REF!"}},0,{"$error":"#REF!"},null,{"$f":"SUM(#REF!,#REF!)","v":{"$error":"#REF!"}},{"$f":"SUM(#REF!,#REF!,#REF!,#REF!)","v":{"$error":"#REF!"}},{"$f":" SUM(#REF!,#REF!,#REF!,#REF!)","v":{"$error":"#REF!"}},0,{"$error":"#REF!"},null,{"$f":"SUM(#REF!,#REF!,#REF!,#REF!)","v":{"$error":"#REF!"}},{"$f":"SUM(#REF!,#REF!,#REF!,#REF!,#REF!,#REF!,#REF!,#REF!,#REF!,#REF!,#REF!)","v":{"$error":"#REF!"}},{"$f":"SUM(#REF!,#REF!,#REF!,#REF!,#REF!)","v":{"$error":"#REF!"}},0,{"$error":"#REF!"},null,{"$f":"SUM(#REF!,#REF!,#REF!,#REF!)","v":{"$error":"#REF!"}},0,{"$f":"SUM(#REF!)","v":{"$error":"#REF!"}},0,{"$error":"#REF!"},null,{"$f":"SUM(#REF!)","v":{"$error":"#REF!"}},{"$f":"SUM(#REF!,#REF!,#REF!,#REF!,#REF!,#REF!,#REF!,#REF!)","v":{"$error":"#REF!"}},{"$f":"SUM(#REF!)","v":{"$error":"#REF!"}},0,{"$error":"#REF!"},null,0,0,0,0,0,null,0,0,0,0,0,null,"AS26:AX27","Per Diem Cost"]
[null,"Service Truck Mileage Cost",null,{"$error":"#REF!"},{"$error":"#REF!"},{"$error":"#REF!"},0,{"$error":"#REF!"},null,{"$f":"SUM(#REF!,#REF!)","v":{"$error":"#REF!"}},0,{"$f":"SUM(#REF!,#REF!,#REF!,#REF!,#REF!,#REF!,#REF!,#REF!,#REF!,#REF!,#REF!)","v":{"$error":"#REF!"}},0,{"$error":"#REF!"},null,{"$f":"SUM(#REF!,#REF!)","v":{"$error":"#REF!"}},{"$f":"SUM(#REF!,#REF!,#REF!,#REF!)","v":{"$error":"#REF!"}},{"$f":" SUM(#REF!,#REF!,#REF!,#REF!)","v":{"$error":"#REF!"}},0,{"$error":"#REF!"},null,{"$f":"SUM(#REF!,#REF!,#REF!,#REF!)","v":{"$error":"#REF!"}},{"$f":"SUM(#REF!,#REF!,#REF!,#REF!,#REF!,#REF!,#REF!,#REF!,#REF!,#REF!,#REF!)","v":{"$error":"#REF!"}},{"$f":"SUM(#REF!,#REF!,#REF!,#REF!,#REF!)","v":{"$error":"#REF!"}},0,{"$error":"#REF!"},null,{"$f":"SUM(#REF!,#REF!,#REF!,#REF!)","v":{"$error":"#REF!"}},0,{"$f":"SUM(#REF!)","v":{"$error":"#REF!"}},0,{"$error":"#REF!"},null,{"$f":"SUM(#REF!)","v":{"$error":"#REF!"}},{"$f":"SUM(#REF!,#REF!,#REF!,#REF!,#REF!,#REF!,#REF!,#REF!)","v":{"$error":"#REF!"}},{"$f":"SUM(#REF!)","v":{"$error":"#REF!"}},0,{"$error":"#REF!"},null,0,0,0,0,0,null,0,0,0,0,0,null,"AS28:AX29","Service Truck Mileage Cost"]
[null,"Relief Travel Cost & Other Special Charges",null,null,null,null,null,{"$f":"SUM(D38:G38)","v":0},null,null,null,null,null,{"$f":"SUM(J38:M38)","v":0},null,null,null,null,null,{"$f":"SUM(P38:S38)","v":0},null,null,null,null,null,{"$f":"SUM(V38:Y38)","v":0},null,null,null,null,null,{"$f":"SUM(AB38:AE38)","v":0},null,null,null,null,null,{"$f":"SUM(AH38:AK38)","v":0},null,null,null,null,null,{"$f":"SUM(AN38:AQ38)","v":0},null,null,null,null,null,{"$f":"SUM(AT38:AW38)","v":0},null,"AS32:AX37","Relief Travel Cost & Other Special Charges"]
[null,"Passengers Transported",null,{"$error":"#REF!"},{"$error":"#REF!"},{"$error":"#REF!"},0,{"$error":"#REF!"},null,{"$f":"SUM(#REF!,#REF!)","v":{"$error":"#REF!"}},0,{"$f":"SUM(#REF!,#REF!,#REF!,#REF!,#REF!,#REF!,#REF!,#REF!,#REF!,#REF!,#REF!)","v":{"$error":"#REF!"}},0,{"$error":"#REF!"},null,{"$f":"SUM(#REF!,#REF!)","v":{"$error":"#REF!"}},{"$f":"SUM(#REF!,#REF!,#REF!,#REF!)","v":{"$error":"#REF!"}},{"$f":" SUM(#REF!,#REF!,#REF!,#REF!)","v":{"$error":"#REF!"}},0,{"$error":"#REF!"},null,{"$f":"SUM(#REF!,#REF!,#REF!,#REF!)","v":{"$error":"#REF!"}},{"$f":"SUM(#REF!,#REF!,#REF!,#REF!,#REF!,#REF!,#REF!,#REF!,#REF!,#REF!,#REF!)","v":{"$error":"#REF!"}},{"$f":"SUM(#REF!,#REF!,#REF!,#REF!,#REF!)","v":{"$error":"#REF!"}},0,{"$error":"#REF!"},null,{"$f":"SUM(#REF!,#REF!,#REF!,#REF!)","v":{"$error":"#REF!"}},0,{"$f":"SUM(#REF!)","v":{"$error":"#REF!"}},0,{"$error":"#REF!"},null,{"$f":"SUM(#REF!)","v":{"$error":"#REF!"}},{"$f":"SUM(#REF!,#REF!,#REF!,#REF!,#REF!,#REF!,#REF!,#REF!)","v":{"$error":"#REF!"}},{"$f":"SUM(#REF!)","v":{"$error":"#REF!"}},0,{"$error":"#REF!"},null,0,0,0,0,0,null,0,0,0,0,0,null,"V43:Z44","Passengers Transported"]
[null,"Cargo Transported (lbs.)",null,{"$error":"#REF!"},{"$error":"#REF!"},{"$error":"#REF!"},0,{"$error":"#REF!"},null,{"$f":"SUM(#REF!,#REF!)","v":{"$error":"#REF!"}},0,{"$f":"SUM(#REF!,#REF!,#REF!,#REF!,#REF!,#REF!,#REF!,#REF!,#REF!,#REF!,#REF!)","v":{"$error":"#REF!"}},0,{"$error":"#REF!"},null,{"$f":"SUM(#REF!,#REF!)","v":{"$error":"#REF!"}},{"$f":"SUM(#REF!,#REF!,#REF!,#REF!)","v":{"$error":"#REF!"}},{"$f":" SUM(#REF!,#REF!,#REF!,#REF!)","v":{"$error":"#REF!"}},0,{"$error":"#REF!"},null,{"$f":"SUM(#REF!,#REF!,#REF!,#REF!)","v":{"$error":"#REF!"}},{"$f":"SUM(#REF!,#REF!,#REF!,#REF!,#REF!,#REF!,#REF!,#REF!,#REF!,#REF!,#REF!)","v":{"$error":"#REF!"}},{"$f":"SUM(#REF!,#REF!,#REF!,#REF!,#REF!)","v":{"$error":"#REF!"}},0,{"$error":"#REF!"},null,{"$f":"SUM(#REF!,#REF!,#REF!,#REF!)","v":{"$error":"#REF!"}},0,{"$f":"SUM(#REF!)","v":{"$error":"#REF!"}},0,{"$error":"#REF!"},null,{"$f":"SUM(#REF!)","v":{"$error":"#REF!"}},{"$f":"SUM(#REF!,#REF!,#REF!,#REF!,#REF!,#REF!,#REF!,#REF!)","v":{"$error":"#REF!"}},{"$f":"SUM(#REF!)","v":{"$error":"#REF!"}},0,{"$error":"#REF!"},null,0,0,0,0,0,null,0,0,0,0,0,null,"AA43:AF44","Cargo Transported (lbs.)"]
[null,"Water Dropped (gal.)",null,null,null,null,{"$f":"SUM(M41,S41,Y41,AE41,AK41,AQ41,AW41)","v":0},0,null,null,null,null,0,0,null,null,null,null,0,0,null,null,null,null,0,0,null,null,null,null,0,0,null,null,null,null,0,0,null,null,null,null,0,0,null,null,null,null,0,0,null,"AG43:AL44","Water Dropped (gal.)"]
[null,"Initial Attacks",null,null,null,null,{"$f":"SUM(M42,S42,Y42,AE42,AK42,AQ42,AW42)","v":0},0,null,null,null,null,0,{"$f":"M42","v":0},null,null,null,null,0,0,null,null,null,null,0,0,null,null,null,null,0,0,null,null,null,null,0,0,null,null,null,null,0,0,null,null,null,null,0,0,null,null,"Initial Attacks"]
[null,"SARs, Projects, Training & Fires Supported",null,{"$f":"SUM(J43,P43,V43,AB43,AH43,AN43,AT43)","v":13},10,22,{"$f":"SUM(M43,S43,Y43,AE43,AK43,)","v":0},null,null,2,0,11,0,{"$f":"M43","v":0},null,2,2,4,0,null,null,4,4,5,0,null,null,4,0,1,0,null,null,1,4,1,0,null,null,0,0,0,0,null,null,0,0,0,0,null,null,null,"SARs, Projects, Training & Fires Supported"]
[null,"Wilderness Fight Time Hours",null,{"$error":"#REF!"},{"$error":"#REF!"},{"$error":"#REF!"},{"$f":"SUM(M44,S44,Y44,AE44,AK44,AQ44,AW44)","v":0},{"$f":"SUM(D44:G44)","v":{"$error":"#REF!"}},null,{"$f":"SUM(#REF!,#REF!)","v":{"$error":"#REF!"}},0,{"$f":"SUM(#REF!,#REF!,#REF!,#REF!,#REF!,#REF!,#REF!,#REF!,#REF!,#REF!,#REF!)","v":{"$error":"#REF!"}},0,{"$f":"SUM(J44:M44)","v":{"$error":"#REF!"}},null,{"$f":"SUM(#REF!,#REF!)","v":{"$error":"#REF!"}},{"$f":"SUM(#REF!,#REF!,#REF!,#REF!)","v":{"$error":"#REF!"}},{"$f":" SUM(#REF!,#REF!,#REF!,#REF!)","v":{"$error":"#REF!"}},0,{"$f":"SUM(P44:S44)","v":{"$error":"#REF!"}},null,{"$f":"SUM(#REF!,#REF!,#REF!,#REF!)","v":{"$error":"#REF!"}},{"$f":"SUM(#REF!,#REF!,#REF!,#REF!,#REF!,#REF!,#REF!,#REF!,#REF!,#REF!,#REF!)","v":{"$error":"#REF!"}},{"$f":"SUM(#REF!,#REF!,#REF!,#REF!,#REF!)","v":{"$error":"#REF!"}},0,{"$f":"SUM(V44:Y44)","v":{"$error":"#REF!"}},null,{"$f":"SUM(#REF!,#REF!,#REF!,#REF!)","v":{"$error":"#REF!"}},0,{"$f":"SUM(#REF!)","v":{"$error":"#REF!"}},0,{"$f":"SUM(AB44:AE44)","v":{"$error":"#REF!"}},null,{"$f":"SUM(#REF!)","v":{"$error":"#REF!"}},{"$f":"SUM(#REF!,#REF!,#REF!,#REF!,#REF!,#REF!,#REF!,#REF!)","v":{"$error":"#REF!"}},{"$f":"SUM(#REF!)","v":{"$error":"#REF!"}},0,{"$f":"SUM(AH44:AK44)","v":{"$error":"#REF!"}},null,0,0,0,0,{"$f":"SUM(AN44:AQ44)","v":0},null,0,0,0,0,{"$f":"SUM(AT44:AW44)","v":0},null,"BN18:BP19","Wilderness Fight Time Hours"]
[null,"Wilderness Landings",null,{"$error":"#REF!"},{"$error":"#REF!"},{"$error":"#REF!"},{"$f":"SUM(M45,S45,Y45,AE45,AK45,AQ45,AW45)","v":0},{"$f":"SUM(D45:G45)","v":{"$error":"#REF!"}},null,{"$f":"SUM(#REF!,#REF!)","v":{"$error":"#REF!"}},0,{"$f":"SUM(#REF!,#REF!,#REF!,#REF!,#REF!,#REF!,#REF!,#REF!,#REF!,#REF!,#REF!)","v":{"$error":"#REF!"}},0,{"$f":"SUM(J45:M45)","v":{"$error":"#REF!"}},null,{"$f":"SUM(#REF!,#REF!)","v":{"$error":"#REF!"}},{"$f":"SUM(#REF!,#REF!,#REF!,#REF!)","v":{"$error":"#REF!"}},{"$f":" SUM(#REF!,#REF!,#REF!,#REF!)","v":{"$error":"#REF!"}},0,{"$f":"SUM(P45:S45)","v":{"$error":"#REF!"}},null,{"$f":"SUM(#REF!,#REF!,#REF!,#REF!)","v":{"$error":"#REF!"}},{"$f":"SUM(#REF!,#REF!,#REF!,#REF!,#REF!,#REF!,#REF!,#REF!,#REF!,#REF!,#REF!)","v":{"$error":"#REF!"}},{"$f":"SUM(#REF!,#REF!,#REF!,#REF!,#REF!)","v":{"$error":"#REF!"}},0,{"$f":"SUM(V45:Y45)","v":{"$error":"#REF!"}},null,{"$f":"SUM(#REF!,#REF!,#REF!,#REF!)","v":{"$error":"#REF!"}},0,{"$f":"SUM(#REF!)","v":{"$error":"#REF!"}},0,{"$f":"SUM(AB45:AE45)","v":{"$error":"#REF!"}},null,{"$f":"SUM(#REF!)","v":{"$error":"#REF!"}},{"$f":"SUM(#REF!,#REF!,#REF!,#REF!,#REF!,#REF!,#REF!,#REF!)","v":{"$error":"#REF!"}},{"$f":"SUM(#REF!)","v":{"$error":"#REF!"}},0,{"$f":"SUM(AH45:AK45)","v":{"$error":"#REF!"}},null,0,0,0,0,{"$f":"SUM(AN45:AQ45)","v":0},null,0,0,0,0,{"$f":"SUM(AT45:AW45)","v":0},null,"BN20:BP21","Wilderness Landings"]
[null,"Wilderness Ext. Load Deliveries & Pickups",null,{"$error":"#REF!"},{"$error":"#REF!"},{"$error":"#REF!"},{"$f":"SUM(M46,S46,Y46,AE46,AK46,AQ46,AW46)","v":0},{"$f":"SUM(D46:G46)","v":{"$error":"#REF!"}},null,{"$f":"SUM(#REF!,#REF!)","v":{"$error":"#REF!"}},0,{"$f":"SUM(#REF!,#REF!,#REF!,#REF!,#REF!,#REF!,#REF!,#REF!,#REF!,#REF!,#REF!)","v":{"$error":"#REF!"}},0,{"$f":"SUM(J46:M46)","v":{"$error":"#REF!"}},null,{"$f":"SUM(#REF!,#REF!)","v":{"$error":"#REF!"}},{"$f":"SUM(#REF!,#REF!,#REF!,#REF!)","v":{"$error":"#REF!"}},{"$f":" SUM(#REF!,#REF!,#REF!,#REF!)","v":{"$error":"#REF!"}},0,{"$f":"SUM(P46:S46)","v":{"$error":"#REF!"}},null,{"$f":"SUM(#REF!,#REF!,#REF!,#REF!)","v":{"$error":"#REF!"}},{"$f":"SUM(#REF!,#REF!,#REF!,#REF!,#REF!,#REF!,#REF!,#REF!,#REF!,#REF!,#REF!)","v":{"$error":"#REF!"}},{"$f":"SUM(#REF!,#REF!,#REF!,#REF!,#REF!)","v":{"$error":"#REF!"}},0,{"$f":"SUM(V46:Y46)","v":{"$error":"#REF!"}},null,{"$f":"SUM(#REF!,#REF!,#REF!,#REF!)","v":{"$error":"#REF!"}},0,{"$f":"SUM(#REF!)","v":{"$error":"#REF!"}},0,{"$f":"SUM(AB46:AE46)","v":{"$error":"#REF!"}},null,{"$f":"SUM(#REF!)","v":{"$error":"#REF!"}},{"$f":"SUM(#REF!,#REF!,#REF!,#REF!,#REF!,#REF!,#REF!,#REF!)","v":{"$error":"#REF!"}},{"$f":"SUM(#REF!)","v":{"$error":"#REF!"}},0,{"$f":"SUM(AH46:AK46)","v":{"$error":"#REF!"}},null,0,0,0,0,{"$f":"SUM(AN46:AQ46)","v":0},null,0,0,0,0,{"$f":"SUM(AT46:AW46)","v":0},null,"BN22:BP23","Wilderness Ext. Load Deliveries & Pickups"]
[null,null,null,{"$f":"D51+D71+D91+D116+D137","v":{"$error":"#REF!"}}]
[null,null,{"$f":"B49","v":"NORTH CASCADES NP"},null,null,null,null,null,{"$f":"B49","v":"NORTH CASCADES NP"},null,null,null,null,null,"NORTH CASCADES NP",null,null,null,null,null,"NORTH CASCADES NP",null,null,null,null,null,"NORTH CASCADES NP",null,null,null,null,null,"NORTH CASCADES NP",null,null,null,null,null,"NORTH CASCADES NP",null,null,null,null,null,"NORTH CASCADES NP"]
[null,"NORTH CASCADES NP",{"$f":"C2","v":"139-day Contract TOTALS"},null,null,null,null,null,"May",null,null,null,null,null,"June",null,null,null,null,null,"July",null,null,null,null,null,"August",null,null,null,null,null,"September",null,null,null,null,null,"October",null,null,null,null,null,"November"]
[null,null,null,"SAR","Project","Training","Fire","Total",null,"SAR (operational)","Project","Training","Fire","Total",null,"SAR (operational)","Project","Training","Fire","Total",null,"SAR (operational)","Project","Training","Fire","Total",null,"SAR (operational)","Project","Training","Fire","Total",null,"SAR (operational)","Project","Training","Fire","Total",null,"SAR (operational)","Project & Training",null,"Fire","Total",null,"SAR (operational)","Project & Training",null,"Fire","Total"]
[null,"Total Cost",null,{"$f":"SUM(J51,P51,V51,AB51,AH51,AN51,AT51)","v":{"$error":"#REF!"}},{"$f":"SUM(K51,Q51,W51,AC51,AI51,AO51,AU51)","v":{"$error":"#REF!"}},{"$f":"SUM(L51,R51,X51,AD51,AJ51,AP51,AV51)","v":{"$error":"#REF!"}},{"$f":"SUM(M51,S51,Y51,AE51,AK51,AQ51,AW51)","v":{"$error":"#REF!"}},{"$f":"SUM(N51,T51,Z51,AF51,AL51,AR51,AX51)","v":{"$error":"#REF!"}},null,{"$f":"J54+J55+J56+J57+J58","v":{"$error":"#REF!"}},{"$f":"K54+K55+K56+K57+K58","v":0},{"$f":"L54+L55+L56+L57+L58","v":0},{"$f":"M54+M55+M56+M57+M58","v":0},{"$f":"SUM(I51:M51)","v":{"$error":"#REF!"}},null,{"$f":"P54+P55+P56+P57+P58","v":{"$error":"#REF!"}},{"$f":"Q54+Q55+Q56+Q57+Q58","v":{"$error":"#REF!"}},{"$f":"R54+R55+R56+R57+R58","v":{"$error":"#REF!"}},{"$f":"S54+S55+S56+S57+S58","v":0},{"$f":"SUM(O51:S51)","v":{"$error":"#REF!"}},null,{"$f":"V54+V55+V56+V57+V58","v":{"$error":"#REF!"}},{"$f":"W54+W55+W56+W57+W58","v":0},{"$f":"X54+X55+X56+X57+X58","v":0},{"$f":"Y54+Y55+Y56+Y57+Y58","v":{"$error":"#REF!"}},{"$f":"SUM(U51:Y51)","v":{"$error":"#REF!"}},null,{"$f":"AB54+AB55+AB56+AB57+AB58","v":{"$error":"#REF!"}},{"$f":"AC54+AC55+AC56+AC57+AC58","v":{"$error":"#REF!"}},{"$f":"AD54+AD55+AD56+AD57+AD58","v":0},{"$f":"AE54+AE55+AE56+AE57+AE58","v":{"$error":"#REF!"}},{"$f":"SUM(AA51:AE51)","v":{"$error":"#REF!"}},null,{"$f":"AH54+AH55+AH56+AH57+AH58","v":0},{"$f":"AI54+AI55+AI56+AI57+AI58","v":{"$error":"#REF!"}},{"$f":"AJ54+AJ55+AJ56+AJ57+AJ58","v":0},{"$f":"AK54+AK55+AK56+AK57+AK58","v":{"$error":"#REF!"}},{"$f":"SUM(AG51:AK51)","v":{"$error":"#REF!"}},null,{"$f":"AN54+AN55+AN56+AN57+AN58","v":0},{"$f":"AO54+AO55+AO56+AO57+AO58","v":0},null,{"$f":"AQ54+AQ55+AQ56+AQ57+AQ58","v":0},{"$f":"SUM(AM51:AQ51)","v":0},null,{"$f":"AT54+AT55+AT56+AT57+AT58","v":0},{"$f":"AU54+AU55+AU56+AU57+AU58","v":0},null,{"$f":"AW54+AW55+AW56+AW57+AW58","v":0},{"$f":"SUM(AS51:AW51)","v":0},null,null,"Total Cost"]
[null,"Flight Time Hours",null,{"$f":"SUM(J52,P52,V52,AB52,AH52,AN52,AT52)","v":{"$error":"#REF!"}},{"$f":"SUM(K52,Q52,W52,AC52,AI52,AO52,AU52)","v":{"$error":"#REF!"}},{"$f":"SUM(L52,R52,X52,AD52,AJ52,AP52,AV52)","v":{"$error":"#REF!"}},{"$f":"SUM(M52,S52,Y52,AE52,AK52,AQ52,AW52)","v":{"$error":"#REF!"}},{"$f":"SUM(D52:G52)","v":{"$error":"#REF!"}},null,{"$f":"SUM(#REF!)","v":{"$error":"#REF!"}},0,0,0,{"$f":"SUM(J52:M52)","v":{"$error":"#REF!"}},null,{"$f":"SUM(#REF!,#REF!,#REF!,#REF!)","v":{"$error":"#REF!"}},{"$f":"SUM(#REF!,#REF!,#REF!,#REF!,#REF!)","v":{"$error":"#REF!"}},{"$f":"SUM(#REF!,#REF!,#REF!,#REF!,#REF!)","v":{"$error":"#REF!"}},0,{"$f":"SUM(P52:S52)","v":{"$error":"#REF!"}},null,{"$f":"SUM(#REF!,#REF!)","v":{"$error":"#REF!"}},0,0,{"$f":"SUM(#REF!,#REF!,#REF!,#REF!,#REF!)","v":{"$error":"#REF!"}},{"$f":"SUM(V52:Y52)","v":{"$error":"#REF!"}},null,{"$f":"SUM(#REF!,#REF!)","v":{"$error":"#REF!"}},{"$f":"SUM(#REF!,#REF!)","v":{"$error":"#REF!"}},0,{"$f":" SUM(#REF!,#REF!,#REF!,#REF!,#REF!,#REF!,#REF!,#REF!,#REF!,#REF!,#REF!,#REF!,#REF!,#REF!,#REF!,#REF!,#REF!,#REF!,#REF!,#REF!,#REF!,#REF!,#REF!,#REF!,#REF!,#REF!,#REF!,#REF!,#REF!,#REF!,#REF!,#REF!,#REF!,#REF!,#REF!)","v":{"$error":"#REF!"}},{"$f":"SUM(AB52:AE52)","v":{"$error":"#REF!"}},null,0,{"$f":"SUM(#REF!,#REF!,#REF!,#REF!)","v":{"$error":"#REF!"}},0,{"$f":"SUM(#REF!,#REF!,#REF!,#REF!)","v":{"$error":"#REF!"}},{"$f":"SUM(AH52:AK52)","v":{"$error":"#REF!"}},null,0,0,null,0,{"$f":"SUM(AN52:AQ52)","v":0},null,0,0,null,0,{"$f":"SUM(AT52:AW52)","v":0},null,"AH16:AL17","Flight Time Hours"]
[null,"Flight Time Percentage",null,{"$f":"IF(SUM(D52:G52)=0,0,D52/SUM(D52:G52))","v":{"$error":"#REF!"}},{"$f":"IF(SUM(D52:G52)=0,0,E52/SUM(D52:G52))","v":{"$error":"#REF!"}},{"$f":"IF(SUM(D52:G52)=0,0,F52/SUM(D52:G52))","v":{"$error":"#REF!"}},{"$f":"IF(SUM(D52:G52)=0,0,G52/SUM(D52:G52))","v":{"$error":"#REF!"}},{"$error":"#REF!"},null,{"$f":"IF(SUM(J52:M52)=0,0,J52/SUM(J52:M52))","v":{"$error":"#REF!"}},{"$f":"IF(SUM(J52:M52)=0,0,K52/SUM(J52:M52))","v":{"$error":"#REF!"}},{"$f":"IF(SUM(J52:M52)=0,0,L52/SUM(J52:M52))","v":{"$error":"#REF!"}},{"$f":"IF(SUM(J52:M52)=0,0,M52/SUM(J52:M52))","v":{"$error":"#REF!"}},{"$f":"SUM(J53:M53)","v":{"$error":"#REF!"}},null,{"$f":"IF(SUM(P52:S52)=0,0,P52/SUM(P52:S52))","v":{"$error":"#REF!"}},{"$f":"IF(SUM(P52:S52)=0,0,Q52/SUM(P52:S52))","v":{"$error":"#REF!"}},{"$f":"IF(SUM(P52:S52)=0,0,R52/SUM(P52:S52))","v":{"$error":"#REF!"}},{"$f":"IF(SUM(P52:S52)=0,0,S52/SUM(P52:S52))","v":{"$error":"#REF!"}},{"$error":"#REF!"},null,{"$f":"IF(SUM(V52:Y52)=0,0,V52/SUM(V52:Y52))","v":{"$error":"#REF!"}},{"$f":"IF(SUM(V52:Y52)=0,0,W52/SUM(V52:Y52))","v":{"$error":"#REF!"}},{"$f":"IF(SUM(V52:Y52)=0,0,X52/SUM(V52:Y52))","v":{"$error":"#REF!"}},{"$f":"IF(SUM(V52:Y52)=0,0,Y52/SUM(V52:Y52))","v":{"$error":"#REF!"}},{"$error":"#REF!"},null,{"$f":"IF(SUM(AB52:AE52)=0,0,AB52/SUM(AB52:AE52))","v":{"$error":"#REF!"}},{"$f":"IF(SUM(AB52:AE52)=0,0,AC52/SUM(AB52:AE52))","v":{"$error":"#REF!"}},{"$f":"IF(SUM(AB52:AE52)=0,0,AD52/SUM(AB52:AE52))","v":{"$error":"#REF!"}},{"$f":"IF(SUM(AB52:AE52)=0,0,AE52/SUM(AB52:AE52))","v":{"$error":"#REF!"}},{"$error":"#REF!"},null,{"$f":"IF(SUM(AH52:AK52)=0,0,AH52/SUM(AH52:AK52))","v":{"$error":"#REF!"}},{"$f":"IF(SUM(AH52:AK52)=0,0,AI52/SUM(AH52:AK52))","v":{"$error":"#REF!"}},{"$f":"IF(SUM(AH52:AK52)=0,0,AJ52/SUM(AH52:AK52))","v":{"$error":"#REF!"}},{"$f":"IF(SUM(AH52:AK52)=0,0,AK52/SUM(AH52:AK52))","v":{"$error":"#REF!"}},{"$error":"#REF!"},null,{"$f":"IF(SUM(AN52:AQ52)=0,0,AN52/SUM(AN52:AQ52))","v":0},{"$f":"IF(SUM(AN52:AQ52)=0,0,AO52/SUM(AN52:AQ52))","v":0},{"$f":"IF(SUM(AN52:AQ52)=0,0,AP52/SUM(AN52:AQ52))","v":0},{"$f":"IF(SUM(AN52:AQ52)=0,0,AQ52/SUM(AN52:AQ52))","v":0},0,null,{"$f":"IF(SUM(AT52:AW52)=0,0,AT52/SUM(AT52:AW52))","v":0},{"$f":"IF(SUM(AT52:AW52)=0,0,AU52/SUM(AT52:AW52))","v":0},{"$f":"IF(SUM(AT52:AW52)=0,0,AV52/SUM(AT52:AW52))","v":0},{"$f":"IF(SUM(AT52:AW52)=0,0,AW52/SUM(AT52:AW52))","v":0},0,null,null,"Flight Time Percentage"]
[null,"Flight Time Cost",null,{"$f":"SUM(J54,P54,V54,AB54,AH54,AN54,AT54)","v":{"$error":"#REF!"}},{"$error":"#REF!"},{"$error":"#REF!"},{"$error":"#REF!"},{"$error":"#REF!"},null,{"$f":"J52*'Contract Info'!$D$18","v":{"$error":"#REF!"}},{"$f":"K52*'Contract Info'!$D$18","v":0},{"$f":"L52*'Contract Info'!$D$18","v":0},{"$f":"M52*'Contract Info'!$D$18","v":0},{"$error":"#REF!"},null,{"$f":"P52*'Contract Info'!$D$18","v":{"$error":"#REF!"}},{"$f":"Q52*'Contract Info'!$D$18","v":{"$error":"#REF!"}},{"$f":"R52*'Contract Info'!$D$18","v":{"$error":"#REF!"}},{"$f":"S52*'Contract Info'!$D$18","v":0},{"$error":"#REF!"},null,{"$f":"V52*'Contract Info'!$D$18","v":{"$error":"#REF!"}},{"$f":"W52*'Contract Info'!$D$18","v":0},{"$f":"X52*'Contract Info'!$D$18","v":0},{"$f":"Y52*'Contract Info'!$D$18","v":{"$error":"#REF!"}},{"$error":"#REF!"},null,{"$f":"AB52*'Contract Info'!$D$18","v":{"$error":"#REF!"}},{"$f":"AC52*'Contract Info'!$D$18","v":{"$error":"#REF!"}},{"$f":"AD52*'Contract Info'!$D$18","v":0},{"$f":"AE52*'Contract Info'!$D$18","v":{"$error":"#REF!"}},{"$error":"#REF!"},null,{"$f":"AH52*'Contract Info'!$D$18","v":0},{"$f":"AI52*'Contract Info'!$D$18","v":{"$error":"#REF!"}},{"$f":"AJ52*'Contract Info'!$D$18","v":0},{"$f":"AK52*'Contract Info'!$D$18","v":{"$error":"#REF!"}},{"$error":"#REF!"},null,{"$f":"AN52*'Contract Info'!$D$18","v":0},{"$f":"AO52*'Contract Info'!$D$18","v":0},{"$f":"AP52*'Contract Info'!$D$18","v":0},{"$f":"AQ52*'Contract Info'!$D$18","v":0},0,null,{"$f":"AT52*'Contract Info'!$D$18","v":0},{"$f":"AU52*'Contract Info'!$D$18","v":0},{"$f":"AV52*'Contract Info'!$D$18","v":0},{"$f":"AW52*'Contract Info'!$D$18","v":0},0,null,null,"Flight Time Cost"]
[null,"Extended Standby Cost",null,{"$error":"#REF!"},{"$error":"#REF!"},{"$error":"#REF!"},{"$error":"#REF!"},{"$error":"#REF!"},null,{"$f":"SUM(#REF!)","v":{"$error":"#REF!"}},0,0,0,{"$error":"#REF!"},null,{"$f":"SUM(#REF!,#REF!,#REF!,#REF!)","v":{"$error":"#REF!"}},{"$f":"SUM(#REF!,#REF!,#REF!,#REF!,#REF!)","v":{"$error":"#REF!"}},{"$f":"SUM(#REF!,#REF!,#REF!,#REF!,#REF!)","v":{"$error":"#REF!"}},0,{"$error":"#REF!"},null,{"$f":"SUM(#REF!,#REF!)","v":{"$error":"#REF!"}},0,0,{"$f":"SUM(#REF!,#REF!,#REF!,#REF!,#REF!)","v":{"$error":"#REF!"}},{"$error":"#REF!"},null,{"$f":"SUM(#REF!,#REF!)","v":{"$error":"#REF!"}},{"$f":"SUM(#REF!,#REF!)","v":{"$error":"#REF!"}},0,{"$f":" SUM(#REF!,#REF!,#REF!,#REF!,#REF!,#REF!,#REF!,#REF!,#REF!,#REF!,#REF!,#REF!,#REF!,#REF!,#REF!,#REF!,#REF!,#REF!,#REF!,#REF!,#REF!,#REF!,#REF!,#REF!,#REF!,#REF!,#REF!,#REF!,#REF!,#REF!,#REF!,#REF!,#REF!,#REF!,#REF!)","v":{"$error":"#REF!"}},{"$error":"#REF!"},null,0,{"$f":"SUM(#REF!,#REF!,#REF!,#REF!)","v":{"$error":"#REF!"}},0,{"$f":"SUM(#REF!,#REF!,#REF!,#REF!)","v":{"$error":"#REF!"}},{"$error":"#REF!"},null,0,0,null,0,0,null,0,0,null,0,0,null,"AS20:AX25","Extended Standby Cost"]
[null,"Per Diem Cost",null,{"$error":"#REF!"},{"$error":"#REF!"},{"$error":"#REF!"},{"$error":"#REF!"},{"$error":"#REF!"},null,{"$f":"SUM(#REF!)","v":{"$error":"#REF!"}},0,0,0,{"$error":"#REF!"},null,{"$f":"SUM(#REF!,#REF!,#REF!,#REF!)","v":{"$error":"#REF!"}},{"$f":"SUM(#REF!,#REF!,#REF!,#REF!,#REF!)","v":{"$error":"#REF!"}},{"$f":"SUM(#REF!,#REF!,#REF!,#REF!,#REF!)","v":{"$error":"#REF!"}},0,{"$error":"#REF!"},null,{"$f":"SUM(#REF!,#REF!)","v":{"$error":"#REF!"}},0,0,{"$f":"SUM(#REF!,#REF!,#REF!,#REF!,#REF!)","v":{"$error":"#REF!"}},{"$error":"#REF!"},null,{"$f":"SUM(#REF!,#REF!)","v":{"$error":"#REF!"}},{"$f":"SUM(#REF!,#REF!)","v":{"$error":"#REF!"}},0,{"$f":" SUM(#REF!,#REF!,#REF!,#REF!,#REF!,#REF!,#REF!,#REF!,#REF!,#REF!,#REF!,#REF!,#REF!,#REF!,#REF!,#REF!,#REF!,#REF!,#REF!,#REF!,#REF!,#REF!,#REF!,#REF!,#REF!,#REF!,#REF!,#REF!,#REF!,#REF!,#REF!,#REF!,#REF!,#REF!,#REF!)","v":{"$error":"#REF!"}},{"$error":"#REF!"},null,0,{"$f":"SUM(#REF!,#REF!,#REF!,#REF!)","v":{"$error":"#REF!"}},0,{"$f":"SUM(#REF!,#REF!,#REF!,#REF!)","v":{"$error":"#REF!"}},{"$error":"#REF!"},null,0,0,null,0,0,null,0,0,null,0,0,null,"AS26:AX27","Per Diem Cost"]
[null,"Service Truck Mileage Cost",null,{"$error":"#REF!"},{"$error":"#REF!"},{"$error":"#REF!"},{"$error":"#REF!"},{"$error":"#REF!"},null,{"$f":"SUM(#REF!)","v":{"$error":"#REF!"}},0,0,0,{"$error":"#REF!"},null,{"$f":"SUM(#REF!,#REF!,#REF!,#REF!)","v":{"$error":"#REF!"}},{"$f":"SUM(#REF!,#REF!,#REF!,#REF!,#REF!)","v":{"$error":"#REF!"}},{"$f":"SUM(#REF!,#REF!,#REF!,#REF!,#REF!)","v":{"$error":"#REF!"}},0,{"$error":"#REF!"},null,{"$f":"SUM(#REF!,#REF!)","v":{"$error":"#REF!"}},0,0,{"$f":"SUM(#REF!,#REF!,#REF!,#REF!,#REF!)","v":{"$error":"#REF!"}},{"$error":"#REF!"},null,{"$f":"SUM(#REF!,#REF!)","v":{"$error":"#REF!"}},{"$f":"SUM(#REF!,#REF!)","v":{"$error":"#REF!"}},0,{"$f":" SUM(#REF!,#REF!,#REF!,#REF!,#REF!,#REF!,#REF!,#REF!,#REF!,#REF!,#REF!,#REF!,#REF!,#REF!,#REF!,#REF!,#REF!,#REF!,#REF!,#REF!,#REF!,#REF!,#REF!,#REF!,#REF!,#REF!,#REF!,#REF!,#REF!,#REF!,#REF!,#REF!,#REF!,#REF!,#REF!)","v":{"$error":"#REF!"}},{"$error":"#REF!"},null,0,{"$f":"SUM(#REF!,#REF!,#REF!,#REF!)","v":{"$error":"#REF!"}},0,{"$f":"SUM(#REF!,#REF!,#REF!,#REF!)","v":{"$error":"#REF!"}},{"$error":"#REF!"},null,0,0,null,0,0,null,0,0,null,0,0,null,"AS28:AX29","Service Truck Mileage Cost"]
[null,"Relief Travel Cost & Other Special Charges",null,null,null,null,null,{"$f":"SUM(D58:G58)","v":0},null,null,null,null,null,{"$f":"SUM(J58:M58)","v":0},null,null,null,null,null,{"$f":"SUM(P58:S58)","v":0},null,null,null,null,null,{"$f":"SUM(V58:Y58)","v":0},null,null,null,null,null,{"$f":"SUM(AB58:AE58)","v":0},null,null,null,null,null,{"$f":"SUM(AH58:AK58)","v":0},null,null,null,null,null,0,null,null,null,null,null,0,null,"AS32:AX37","Relief Travel Cost & Other Special Charges"]
[null,"Passengers Transported",null,{"$error":"#REF!"},{"$error":"#REF!"},{"$error":"#REF!"},{"$error":"#REF!"},{"$error":"#REF!"},null,{"$f":"SUM(#REF!)","v":{"$error":"#REF!"}},0,0,0,{"$error":"#REF!"},null,{"$f":"SUM(#REF!,#REF!,#REF!,#REF!)","v":{"$error":"#REF!"}},{"$f":"SUM(#REF!,#REF!,#REF!,#REF!,#REF!)","v":{"$error":"#REF!"}},{"$f":"SUM(#REF!,#REF!,#REF!,#REF!,#REF!)","v":{"$error":"#REF!"}},0,{"$error":"#REF!"},null,{"$f":"SUM(#REF!,#REF!)","v":{"$error":"#REF!"}},0,0,{"$f":"SUM(#REF!,#REF!,#REF!,#REF!,#REF!)","v":{"$error":"#REF!"}},{"$error":"#REF!"},null,{"$f":"SUM(#REF!,#REF!)","v":{"$error":"#REF!"}},{"$f":"SUM(#REF!,#REF!)","v":{"$error":"#REF!"}},0,{"$f":" SUM(#REF!,#REF!,#REF!,#REF!,#REF!,#REF!,#REF!,#REF!,#REF!,#REF!,#REF!,#REF!,#REF!,#REF!,#REF!,#REF!,#REF!,#REF!,#REF!,#REF!,#REF!,#REF!,#REF!,#REF!,#REF!,#REF!,#REF!,#REF!,#REF!,#REF!,#REF!,#REF!,#REF!,#REF!,#REF!)","v":{"$error":"#REF!"}},{"$error":"#REF!"},null,0,{"$f":"SUM(#REF!,#REF!,#REF!,#REF!)","v":{"$error":"#REF!"}},0,{"$f":"SUM(#REF!,#REF!,#REF!,#REF!)","v":{"$error":"#REF!"}},{"$error":"#REF!"},null,0,0,null,0,0,null,0,0,null,0,0,null,"V43:Z44","Passengers Transported"]
[null,"Cargo Transported (lbs.)",null,{"$error":"#REF!"},{"$error":"#REF!"},{"$error":"#REF!"},{"$error":"#REF!"},{"$error":"#REF!"},null,{"$f":"SUM(#REF!)","v":{"$error":"#REF!"}},0,0,0,{"$error":"#REF!"},null,{"$f":"SUM(#REF!,#REF!,#REF!,#REF!)","v":{"$error":"#REF!"}},{"$f":"SUM(#REF!,#REF!,#REF!,#REF!,#REF!)","v":{"$error":"#REF!"}},{"$f":"SUM(#REF!,#REF!,#REF!,#REF!,#REF!)","v":{"$error":"#REF!"}},0,{"$error":"#REF!"},null,{"$f":"SUM(#REF!,#REF!)","v":{"$error":"#REF!"}},0,0,{"$f":"SUM(#REF!,#REF!,#REF!,#REF!,#REF!)","v":{"$error":"#REF!"}},{"$error":"#REF!"},null,{"$f":"SUM(#REF!,#REF!)","v":{"$error":"#REF!"}},{"$f":"SUM(#REF!,#REF!)","v":{"$error":"#REF!"}},0,{"$f":" SUM(#REF!,#REF!,#REF!,#REF!,#REF!,#REF!,#REF!,#REF!,#REF!,#REF!,#REF!,#REF!,#REF!,#REF!,#REF!,#REF!,#REF!,#REF!,#REF!,#REF!,#REF!,#REF!,#REF!,#REF!,#REF!,#REF!,#REF!,#REF!,#REF!,#REF!,#REF!,#REF!,#REF!,#REF!,#REF!)","v":{"$error":"#REF!"}},{"$error":"#REF!"},null,0,{"$f":"SUM(#REF!,#REF!,#REF!,#REF!)","v":{"$error":"#REF!"}},0,{"$f":"SUM(#REF!,#REF!,#REF!,#REF!)","v":{"$error":"#REF!"}},{"$error":"#REF!"},null,0,0,null,0,0,null,0,0,null,0,0,null,"AA43:AF44","Cargo Transported (lbs.)"]
[null,"Water Dropped (gal.)",null,null,null,null,{"$f":"SUM(M61,S61,Y61,AE61,AK61,AQ61,AW61)","v":{"$error":"#REF!"}},{"$error":"#REF!"},null,null,null,null,0,0,null,null,null,null,0,0,null,null,null,null,{"$f":"SUM(#REF!,#REF!,#REF!,#REF!,#REF!)","v":{"$error":"#REF!"}},{"$error":"#REF!"},null,null,null,null,{"$f":" SUM(#REF!,#REF!,#REF!,#REF!,#REF!,#REF!,#REF!,#REF!,#REF!,#REF!,#REF!,#REF!,#REF!,#REF!,#REF!,#REF!,#REF!,#REF!,#REF!,#REF!,#REF!,#REF!,#REF!,#REF!,#REF!,#REF!,#REF!,#REF!,#REF!,#REF!,#REF!,#REF!,#REF!,#REF!,#REF!)","v":{"$error":"#REF!"}},{"$error":"#REF!"},null,null,null,null,{"$f":"SUM(#REF!,#REF!,#REF!,#REF!)","v":{"$error":"#REF!"}},{"$error":"#REF!"},null,null,null,null,0,0,null,null,null,null,0,0,null,"AG43:AL44","Water Dropped (gal.)"]
[null,"Initial Attacks",null,null,null,null,1,1,null,null,null,null,0,{"$f":"M62","v":0},null,null,null,null,0,0,null,null,null,null,1,1,null,null,null,null,0,0,null,null,null,null,null,0,null,null,null,null,0,0,null,null,null,null,0,0,null,null,"Initial Attacks"]
[null,"SARs, Projects, Training & Fires Supported",null,{"$f":"SUM(J63,P63,V63,AB63,AH63,AN63,AT63)","v":6},3,3,7,null,null,1,0,0,0,null,null,2,1,3,0,null,null,1,0,0,2,null,null,2,1,0,3,null,null,0,1,0,2,null,null,0,0,null,0,null,null,0,0,null,0,null,null,null,"SARs, Projects, Training & Fires Supported"]
[null,"Wilderness Fight Time Hours",null,{"$error":"#REF!"},{"$error":"#REF!"},{"$error":"#REF!"},{"$error":"#REF!"},{"$f":"SUM(D64:G64)","v":{"$error":"#REF!"}},null,{"$f":"SUM(#REF!)","v":{"$error":"#REF!"}},0,0,0,{"$f":"SUM(J64:M64)","v":{"$error":"#REF!"}},null,{"$f":"SUM(#REF!,#REF!,#REF!,#REF!)","v":{"$error":"#REF!"}},{"$f":"SUM(#REF!,#REF!,#REF!,#REF!,#REF!)","v":{"$error":"#REF!"}},{"$f":"SUM(#REF!,#REF!,#REF!,#REF!,#REF!)","v":{"$error":"#REF!"}},0,{"$f":"SUM(P64:S64)","v":{"$error":"#REF!"}},null,{"$f":"SUM(#REF!,#REF!)","v":{"$error":"#REF!"}},0,0,{"$f":"SUM(#REF!,#REF!,#REF!,#REF!,#REF!)","v":{"$error":"#REF!"}},{"$f":"SUM(V64:Y64)","v":{"$error":"#REF!"}},null,{"$f":"SUM(#REF!,#REF!)","v":{"$error":"#REF!"}},{"$f":"SUM(#REF!,#REF!)","v":{"$error":"#REF!"}},0,{"$f":" SUM(#REF!,#REF!,#REF!,#REF!,#REF!,#REF!,#REF!,#REF!,#REF!,#REF!,#REF!,#REF!,#REF!,#REF!,#REF!,#REF!,#REF!,#REF!,#REF!,#REF!,#REF!,#REF!,#REF!,#REF!,#REF!,#REF!,#REF!,#REF!,#REF!,#REF!,#REF!,#REF!,#REF!,#REF!,#REF!)","v":{"$error":"#REF!"}},{"$f":"SUM(AB64:AE64)","v":{"$error":"#REF!"}},null,0,{"$f":"SUM(#REF!,#REF!,#REF!,#REF!)","v":{"$error":"#REF!"}},0,{"$f":"SUM(#REF!,#REF!,#REF!,#REF!)","v":{"$error":"#REF!"}},{"$f":"SUM(AH64:AK64)","v":{"$error":"#REF!"}},null,0,0,null,0,{"$f":"SUM(AN64:AQ64)","v":0},null,0,0,null,0,{"$f":"SUM(AT64:AW64)","v":0},null,"BN18:BP19","Wilderness Fight Time Hours"]
[null,"Wilderness Landings",null,{"$error":"#REF!"},{"$error":"#REF!"},{"$error":"#REF!"},{"$error":"#REF!"},{"$f":"SUM(D65:G65)","v":{"$error":"#REF!"}},null,{"$f":"SUM(#REF!)","v":{"$error":"#REF!"}},0,0,0,{"$f":"SUM(J65:M65)","v":{"$error":"#REF!"}},null,{"$f":"SUM(#REF!,#REF!,#REF!,#REF!)","v":{"$error":"#REF!"}},{"$f":"SUM(#REF!,#REF!,#REF!,#REF!,#REF!)","v":{"$error":"#REF!"}},{"$f":"SUM(#REF!,#REF!,#REF!,#REF!,#REF!)","v":{"$error":"#REF!"}},0,{"$f":"SUM(P65:S65)","v":{"$error":"#REF!"}},null,{"$f":"SUM(#REF!,#REF!)","v":{"$error":"#REF!"}},0,0,{"$f":"SUM(#REF!,#REF!,#REF!,#REF!,#REF!)","v":{"$error":"#REF!"}},{"$f":"SUM(V65:Y65)","v":{"$error":"#REF!"}},null,{"$f":"SUM(#REF!,#REF!)","v":{"$error":"#REF!"}},{"$f":"SUM(#REF!,#REF!)","v":{"$error":"#REF!"}},0,{"$f":" SUM(#REF!,#REF!,#REF!,#REF!,#REF!,#REF!,#REF!,#REF!,#REF!,#REF!,#REF!,#REF!,#REF!,#REF!,#REF!,#REF!,#REF!,#REF!,#REF!,#REF!,#REF!,#REF!,#REF!,#REF!,#REF!,#REF!,#REF!,#REF!,#REF!,#REF!,#REF!,#REF!,#REF!,#REF!,#REF!)","v":{"$error":"#REF!"}},{"$f":"SUM(AB65:AE65)","v":{"$error":"#REF!"}},null,0,{"$f":"SUM(#REF!,#REF!,#REF!,#REF!)","v":{"$error":"#REF!"}},0,{"$f":"SUM(#REF!,#REF!,#REF!,#REF!)","v":{"$error":"#REF!"}},{"$f":"SUM(AH65:AK65)","v":{"$error":"#REF!"}},null,0,0,null,0,{"$f":"SUM(AN65:AQ65)","v":0},null,0,0,null,0,{"$f":"SUM(AT65:AW65)","v":0},null,"BN20:BP21","Wilderness Landings"]
[null,"Wilderness Ext. Load Deliveries & Pickups",null,{"$error":"#REF!"},{"$error":"#REF!"},{"$error":"#REF!"},{"$error":"#REF!"},{"$f":"SUM(D66:G66)","v":{"$error":"#REF!"}},null,{"$f":"SUM(#REF!)","v":{"$error":"#REF!"}},0,0,0,{"$f":"SUM(J66:M66)","v":{"$error":"#REF!"}},null,{"$f":"SUM(#REF!,#REF!,#REF!,#REF!)","v":{"$error":"#REF!"}},{"$f":"SUM(#REF!,#REF!,#REF!,#REF!,#REF!)","v":{"$error":"#REF!"}},{"$f":"SUM(#REF!,#REF!,#REF!,#REF!,#REF!)","v":{"$error":"#REF!"}},0,{"$f":"SUM(P66:S66)","v":{"$error":"#REF!"}},null,{"$f":"SUM(#REF!,#REF!)","v":{"$error":"#REF!"}},0,0,{"$f":"SUM(#REF!,#REF!,#REF!,#REF!,#REF!)","v":{"$error":"#REF!"}},{"$f":"SUM(V66:Y66)","v":{"$error":"#REF!"}},null,{"$f":"SUM(#REF!,#REF!)","v":{"$error":"#REF!"}},{"$f":"SUM(#REF!,#REF!)","v":{"$error":"#REF!"}},0,{"$f":" SUM(#REF!,#REF!,#REF!,#REF!,#REF!,#REF!,#REF!,#REF!,#REF!,#REF!,#REF!,#REF!,#REF!,#REF!,#REF!,#REF!,#REF!,#REF!,#REF!,#REF!,#REF!,#REF!,#REF!,#REF!,#REF!,#REF!,#REF!,#REF!,#REF!,#REF!,#REF!,#REF!,#REF!,#REF!,#REF!)","v":{"$error":"#REF!"}},{"$f":"SUM(AB66:AE66)","v":{"$error":"#REF!"}},null,0,{"$f":"SUM(#REF!,#REF!,#REF!,#REF!)","v":{"$error":"#REF!"}},0,{"$f":"SUM(#REF!,#REF!,#REF!,#REF!)","v":{"$error":"#REF!"}},{"$f":"SUM(AH66:AK66)","v":{"$error":"#REF!"}},null,0,0,null,0,{"$f":"SUM(AN66:AQ66)","v":0},null,0,0,null,0,{"$f":"SUM(AT66:AW66)","v":0},null,"BN22:BP23","Wilderness Ext. Load Deliveries & Pickups"]
[]
[null,null,{"$f":"$B69","v":"OLYMPIC NP"},null,null,null,null,null,{"$f":"$B69","v":"OLYMPIC NP"},null,null,null,null,null,{"$f":"$B69","v":"OLYMPIC NP"},null,null,null,null,null,{"$f":"$B69","v":"OLYMPIC NP"},null,null,null,null,null,{"$f":"$B69","v":"OLYMPIC NP"},null,null,null,null,null,{"$f":"$B69","v":"OLYMPIC NP"},null,null,null,null,null,{"$f":"$B69","v":"OLYMPIC NP"},null,null,null,null,null,{"$f":"$B69","v":"OLYMPIC NP"}]
[null,"OLYMPIC NP",{"$f":"C2","v":"139-day Contract TOTALS"},null,null,null,null,null,"May",null,null,null,null,null,"June",null,null,null,null,null,"July",null,null,null,null,null,"August",null,null,null,null,null,"September",null,null,null,null,null,"October",null,null,null,null,null,"November"]
[null,null,null,"SAR","Project","Training","Fire","Total",null,"SAR (operational)","Project","Training","Fire","Total",null,"SAR (operational)","Project","Training","Fire","Total",null,"SAR (operational)","Project","Training","Fire","Total",null,"SAR (operational)","Project & Training",null,"Fire","Total",null,"SAR (operational)","Project","Training","Fire","Total",null,"SAR (operational)","Project & Training",null,"Fire","Total",null,"SAR (operational)","Project & Training",null,"Fire","Total"]
[null,"Total Cost",null,{"$f":"SUM(J71,P71,V71,AB71,AH71,AN71,AT71)","v":{"$error":"#REF!"}},{"$f":"SUM(K71,Q71,W71,AC71,AI71,AO71,AU71)","v":0},{"$f":"SUM(L71,R71,X71,AD71,AJ71,AP71,AV71)","v":{"$error":"#REF!"}},{"$f":"SUM(M71,S71,Y71,AE71,AK71,AQ71,AW71)","v":0},{"$f":"SUM(N71,T71,Z71,AF71,AL71,AR71,AX71)","v":{"$error":"#REF!"}},null,{"$f":"J74+J75+J76+J77+J78","v":0},{"$f":"K74+K75+K76+K77+K78","v":0},{"$f":"L74+L75+L76+L77+L78","v":{"$error":"#REF!"}},{"$f":"M74+M75+M76+M77+M78","v":0},{"$f":"SUM(I71:M71)","v":{"$error":"#REF!"}},null,{"$f":"P74+P75+P76+P77+P78","v":{"$error":"#REF!"}},{"$f":"Q74+Q75+Q76+Q77+Q78","v":0},{"$f":"R74+R75+R76+R77+R78","v":0},{"$f":"S74+S75+S76+S77+S78","v":0},{"$f":"SUM(O71:S71)","v":{"$error":"#REF!"}},null,{"$f":"V74+V75+V76+V77+V78","v":{"$error":"#REF!"}},{"$f":"W74+W75+W76+W77+W78","v":0},{"$f":"X74+X75+X76+X77+X78","v":0},{"$f":"Y74+Y75+Y76+Y77+Y78","v":0},{"$f":"SUM(U71:Y71)","v":{"$error":"#REF!"}},null,{"$f":"AB74+AB75+AB76+AB77+AB78","v":{"$error":"#REF!"}},{"$f":"AC74+AC75+AC76+AC77+AC78","v":0},{"$f":"AD74+AD75+AD76+AD77+AD78","v":0},{"$f":"AE74+AE75+AE76+AE77+AE78","v":0},{"$f":"SUM(AA71:AE71)","v":{"$error":"#REF!"}},null,{"$f":"AH74+AH75+AH76+AH77+AH78","v":0},{"$f":"AI74+AI75+AI76+AI77+AI78","v":0},{"$f":"AJ74+AJ75+AJ76+AJ77+AJ78","v":0},{"$f":"AK74+AK75+AK76+AK77+AK78","v":0},{"$f":"SUM(AG71:AK71)","v":0},null,{"$f":"AN74+AN75+AN76+AN77+AN78","v":0},{"$f":"AO74+AO75+AO76+AO77+AO78","v":0},{"$f":"AP74+AP75+AP76+AP77+AP78","v":0},{"$f":"AQ74+AQ75+AQ76+AQ77+AQ78","v":0},{"$f":"SUM(AM71:AQ71)","v":0},null,{"$f":"AT74+AT75+AT76+AT77+AT78","v":0},{"$f":"AU74+AU75+AU76+AU77+AU78","v":0},{"$f":"AV74+AV75+AV76+AV77+AV78","v":0},{"$f":"AW74+AW75+AW76+AW77+AW78","v":0},{"$f":"SUM(AS71:AW71)","v":0},null,null,"Total Cost"]
[null,"Flight Time Hours",null,{"$f":"SUM(J72,P72,V72,AB72,AH72,AN72,AT72)","v":{"$error":"#REF!"}},{"$f":"SUM(K72,Q72,W72,AC72,AI72,AO72,AU72)","v":0},{"$f":"SUM(L72,R72,X72,AD72,AJ72,AP72,AV72)","v":{"$error":"#REF!"}},{"$f":"SUM(M72,S72,Y72,AE72,AK72,AQ72,AW72)","v":0},{"$f":"SUM(D72:G72)","v":{"$error":"#REF!"}},null,0,0,{"$f":"SUM(#REF!,#REF!,#REF!)","v":{"$error":"#REF!"}},0,{"$f":"SUM(J72:M72)","v":{"$error":"#REF!"}},null,{"$f":"SUM(#REF!)","v":{"$error":"#REF!"}},0,0,0,{"$f":"SUM(P72:S72)","v":{"$error":"#REF!"}},null,{"$f":"SUM(#REF!,#REF!)","v":{"$error":"#REF!"}},0,0,0,{"$f":"SUM(V72:Y72)","v":{"$error":"#REF!"}},null,{"$f":"SUM(#REF!,#REF!,#REF!)","v":{"$error":"#REF!"}},0,0,0,{"$f":"SUM(AB72:AE72)","v":{"$error":"#REF!"}},null,0,0,0,0,{"$f":"SUM(AH72:AK72)","v":0},null,0,0,null,0,{"$f":"SUM(AN72:AQ72)","v":0},null,0,0,null,0,{"$f":"SUM(AT72:AW72)","v":0},null,"AH16:AL17","Flight Time Hours"]
[null,"Flight Time Percentage",null,{"$f":"IF(SUM(D72:G72)=0,0,D72/SUM(D72:G72))","v":{"$error":"#REF!"}},{"$f":"IF(SUM(D72:G72)=0,0,E72/SUM(D72:G72))","v":{"$error":"#REF!"}},{"$f":"IF(SUM(D72:G72)=0,0,F72/SUM(D72:G72))","v":{"$error":"#REF!"}},{"$f":"IF(SUM(D72:G72)=0,0,G72/SUM(D72:G72))","v":{"$error":"#REF!"}},{"$error":"#REF!"},null,{"$f":"IF(SUM(J72:M72)=0,0,J72/SUM(J72:M72))","v":{"$error":"#REF!"}},{"$f":"IF(SUM(J72:M72)=0,0,K72/SUM(J72:M72))","v":{"$error":"#REF!"}},{"$f":"IF(SUM(J72:M72)=0,0,L72/SUM(J72:M72))","v":{"$error":"#REF!"}},{"$f":"IF(SUM(J72:M72)=0,0,M72/SUM(J72:M72))","v":{"$error":"#REF!"}},{"$f":"SUM(J73:M73)","v":{"$error":"#REF!"}},null,{"$f":"IF(SUM(P72:S72)=0,0,P72/SUM(P72:S72))","v":{"$error":"#REF!"}},{"$f":"IF(SUM(P72:S72)=0,0,Q72/SUM(P72:S72))","v":{"$error":"#REF!"}},{"$f":"IF(SUM(P72:S72)=0,0,R72/SUM(P72:S72))","v":{"$error":"#REF!"}},{"$f":"IF(SUM(P72:S72)=0,0,S72/SUM(P72:S72))","v":{"$error":"#REF!"}},{"$f":"SUM(P73:S73)","v":{"$error":"#REF!"}},null,{"$f":"IF(SUM(V72:Y72)=0,0,V72/SUM(V72:Y72))","v":{"$error":"#REF!"}},{"$f":"IF(SUM(V72:Y72)=0,0,W72/SUM(V72:Y72))","v":{"$error":"#REF!"}},{"$f":"IF(SUM(V72:Y72)=0,0,X72/SUM(V72:Y72))","v":{"$error":"#REF!"}},{"$f":"IF(SUM(V72:Y72)=0,0,Y72/SUM(V72:Y72))","v":{"$error":"#REF!"}},{"$error":"#REF!"},null,{"$f":"IF(SUM(AB72:AE72)=0,0,AB72/SUM(AB72:AE72))","v":{"$error":"#REF!"}},{"$f":"IF(SUM(AB72:AE72)=0,0,AC72/SUM(AB72:AE72))","v":{"$error":"#REF!"}},{"$f":"IF(SUM(AB72:AE72)=0,0,AD72/SUM(AB72:AE72))","v":{"$error":"#REF!"}},{"$f":"IF(SUM(AB72:AE72)=0,0,AE72/SUM(AB72:AE72))","v":{"$error":"#REF!"}},{"$error":"#REF!"},null,{"$f":"IF(SUM(AH72:AK72)=0,0,AH72/SUM(AH72:AK72))","v":0},{"$f":"IF(SUM(AH72:AK72)=0,0,AI72/SUM(AH72:AK72))","v":0},{"$f":"IF(SUM(AH72:AK72)=0,0,AJ72/SUM(AH72:AK72))","v":0},{"$f":"IF(SUM(AH72:AK72)=0,0,AK72/SUM(AH72:AK72))","v":0},{"$f":"SUM(AH73:AK73)","v":0},null,{"$f":"IF(SUM(AN72:AQ72)=0,0,AN72/SUM(AN72:AQ72))","v":0},{"$f":"IF(SUM(AN72:AQ72)=0,0,AO72/SUM(AN72:AQ72))","v":0},{"$f":"IF(SUM(AN72:AQ72)=0,0,AP72/SUM(AN72:AQ72))","v":0},{"$f":"IF(SUM(AN72:AQ72)=0,0,AQ72/SUM(AN72:AQ72))","v":0},{"$f":"SUM(AN73:AQ73)","v":0},null,{"$f":"IF(SUM(AT72:AW72)=0,0,AT72/SUM(AT72:AW72))","v":0},{"$f":"IF(SUM(AT72:AW72)=0,0,AU72/SUM(AT72:AW72))","v":0},{"$f":"IF(SUM(AT72:AW72)=0,0,AV72/SUM(AT72:AW72))","v":0},{"$f":"IF(SUM(AT72:AW72)=0,0,AW72/SUM(AT72:AW72))","v":0},{"$f":"SUM(AT73:AW73)","v":0},null,null,"Flight Time Percentage"]
[null,"Flight Time Cost",null,{"$f":"SUM(J74,P74,V74,AB74,AH74,AN74,AT74)","v":{"$error":"#REF!"}},0,{"$error":"#REF!"},0,{"$error":"#REF!"},null,{"$f":"J72*'Contract Info'!$D$18","v":0},{"$f":"K72*'Contract Info'!$D$18","v":0},{"$f":"L72*'Contract Info'!$D$18","v":{"$error":"#REF!"}},{"$f":"M72*'Contract Info'!$D$18","v":0},{"$error":"#REF!"},null,{"$f":"P72*'Contract Info'!$D$18","v":{"$error":"#REF!"}},{"$f":"Q72*'Contract Info'!$D$18","v":0},0,{"$f":"S72*'Contract Info'!$D$18","v":0},{"$error":"#REF!"},null,{"$f":"V72*'Contract Info'!$D$18","v":{"$error":"#REF!"}},{"$f":"W72*'Contract Info'!$D$18","v":0},0,{"$f":"Y72*'Contract Info'!$D$18","v":0},{"$error":"#REF!"},null,{"$f":"AB72*'Contract Info'!$D$18","v":{"$error":"#REF!"}},{"$f":"AC72*'Contract Info'!$D$18","v":0},0,{"$f":"AE72*'Contract Info'!$D$18","v":0},{"$error":"#REF!"},null,{"$f":"AH72*'Contract Info'!$D$18","v":0},{"$f":"AI72*'Contract Info'!$D$18","v":0},0,{"$f":"AK72*'Contract Info'!$D$18","v":0},0,null,{"$f":"AN72*'Contract Info'!$D$18","v":0},{"$f":"AO72*'Contract Info'!$D$18","v":0},null,{"$f":"AQ72*'Contract Info'!$D$18","v":0},0,null,{"$f":"AT72*'Contract Info'!$D$18","v":0},{"$f":"AU72*'Contract Info'!$D$18","v":0},null,{"$f":"AW72*'Contract Info'!$D$18","v":0},0,null,null,"Flight Time Cost"]
[null,"Extended Standby Cost",null,{"$error":"#REF!"},0,{"$error":"#REF!"},0,{"$error":"#REF!"},null,0,0,{"$f":"SUM(#REF!,#REF!,#REF!)","v":{"$error":"#REF!"}},0,{"$error":"#REF!"},null,{"$f":"SUM(#REF!)","v":{"$error":"#REF!"}},0,0,0,{"$error":"#REF!"},null,{"$f":"SUM(#REF!,#REF!)","v":{"$error":"#REF!"}},0,0,0,{"$error":"#REF!"},null,{"$f":"SUM(#REF!,#REF!,#REF!)","v":{"$error":"#REF!"}},0,0,0,{"$error":"#REF!"},null,0,0,0,0,0,null,0,0,null,0,0,null,0,0,null,0,0,null,"AS20:AX25","Extended Standby Cost"]
[null,"Per Diem Cost",null,{"$error":"#REF!"},0,{"$error":"#REF!"},0,{"$error":"#REF!"},null,0,0,{"$f":"SUM(#REF!,#REF!,#REF!)","v":{"$error":"#REF!"}},0,{"$error":"#REF!"},null,{"$f":"SUM(#REF!)","v":{"$error":"#REF!"}},0,0,0,{"$error":"#REF!"},null,{"$f":"SUM(#REF!,#REF!)","v":{"$error":"#REF!"}},0,0,0,{"$error":"#REF!"},null,{"$f":"SUM(#REF!,#REF!,#REF!)","v":{"$error":"#REF!"}},0,0,0,{"$error":"#REF!"},null,0,0,0,0,0,null,0,0,null,0,0,null,0,0,null,0,0,null,"AS26:AX27","Per Diem Cost"]
[null,"Service Truck Mileage Cost",null,{"$error":"#REF!"},0,{"$error":"#REF!"},0,{"$error":"#REF!"},null,0,0,{"$f":"SUM(#REF!,#REF!,#REF!)","v":{"$error":"#REF!"}},0,{"$error":"#REF!"},null,{"$f":"SUM(#REF!)","v":{"$error":"#REF!"}},0,0,0,{"$error":"#REF!"},null,{"$f":"SUM(#REF!,#REF!)","v":{"$error":"#REF!"}},0,0,0,{"$error":"#REF!"},null,{"$f":"SUM(#REF!,#REF!,#REF!)","v":{"$error":"#REF!"}},0,0,0,{"$error":"#REF!"},null,0,0,0,0,0,null,0,0,null,0,0,null,0,0,null,0,0,null,"AS28:AX29","Service Truck Mileage Cost"]
[null,"Relief Travel Cost & Other Special Charges",null,null,null,null,null,{"$f":"SUM(D78:G78)","v":0},null,null,null,null,null,{"$f":"SUM(J78:M78)","v":0},null,null,null,null,null,{"$f":"SUM(P78:S78)","v":0},null,null,null,null,null,{"$f":"SUM(V78:Y78)","v":0},null,null,null,null,null,{"$f":"SUM(AB78:AE78)","v":0},null,null,null,null,null,0,null,null,null,null,null,0,null,null,null,null,null,0,null,"AS32:AX37","Relief Travel Cost & Other Special Charges"]
[null,"Passengers Transported",null,{"$error":"#REF!"},0,{"$error":"#REF!"},0,{"$error":"#REF!"},null,0,0,{"$f":"SUM(#REF!,#REF!,#REF!)","v":{"$error":"#REF!"}},0,{"$error":"#REF!"},null,{"$f":"SUM(#REF!)","v":{"$error":"#REF!"}},0,0,0,{"$error":"#REF!"},null,{"$f":"SUM(#REF!,#REF!)","v":{"$error":"#REF!"}},0,0,0,{"$error":"#REF!"},null,{"$f":"SUM(#REF!,#REF!,#REF!)","v":{"$error":"#REF!"}},0,0,0,{"$error":"#REF!"},null,0,0,0,0,0,null,0,0,null,0,0,null,0,0,null,0,0,null,"V43:Z44","Passengers Transported"]
[null,"Cargo Transported (lbs.)",null,{"$error":"#REF!"},0,{"$error":"#REF!"},0,{"$error":"#REF!"},null,0,0,{"$f":"SUM(#REF!,#REF!,#REF!)","v":{"$error":"#REF!"}},0,{"$error":"#REF!"},null,{"$f":"SUM(#REF!)","v":{"$error":"#REF!"}},0,0,0,{"$error":"#REF!"},null,{"$f":"SUM(#REF!,#REF!)","v":{"$error":"#REF!"}},0,0,0,{"$error":"#REF!"},null,{"$f":"SUM(#REF!,#REF!,#REF!)","v":{"$error":"#REF!"}},0,0,0,{"$error":"#REF!"},null,0,0,0,0,0,null,0,0,null,0,0,null,0,0,null,0,0,null,"AA43:AF44","Cargo Transported (lbs.)"]
[null,"Water Dropped (gal.)",null,null,null,null,{"$f":"SUM(M81,S81,Y81,AE81,AK81,AQ81,AW81)","v":0},0,null,null,null,null,0,0,null,null,null,null,0,0,null,null,null,null,0,0,null,null,null,null,0,0,null,null,null,null,0,0,null,null,null,null,0,0,null,null,null,null,0,0,null,"AG43:AL44","Water Dropped (gal.)"]
[null,"Initial Attacks",null,null,null,null,0,0,null,null,null,null,0,{"$f":"M82","v":0},null,null,null,null,0,0,null,null,null,null,0,0,null,null,null,null,0,0,null,null,null,null,0,0,null,null,null,null,0,0,null,null,null,null,0,0,null,null,"Initial Attacks"]
[null,"SARs, Projects, Training & Fires Supported",null,{"$f":"SUM(J83,P83,V83,AB83,AH83,AN83,AT83)","v":6},0,3,0,null,null,0,0,3,0,null,null,1,0,0,0,null,null,2,0,0,0,null,null,3,0,0,0,null,null,0,0,0,0,null,null,0,0,null,0,null,null,0,0,null,0,null,null,null,"SARs, Projects, Training & Fires Supported"]
[null,"Wilderness Fight Time Hours",null,{"$error":"#REF!"},0,{"$error":"#REF!"},0,{"$f":"SUM(D84:G84)","v":{"$error":"#REF!"}},null,0,0,{"$f":"SUM(#REF!,#REF!,#REF!)","v":{"$error":"#REF!"}},0,{"$f":"SUM(J84:M84)","v":{"$error":"#REF!"}},null,{"$f":"SUM(#REF!)","v":{"$error":"#REF!"}},0,0,0,{"$f":"SUM(P84:S84)","v":{"$error":"#REF!"}},null,{"$f":"SUM(#REF!,#REF!)","v":{"$error":"#REF!"}},0,0,0,{"$f":"SUM(V84:Y84)","v":{"$error":"#REF!"}},null,{"$f":"SUM(#REF!,#REF!,#REF!)","v":{"$error":"#REF!"}},0,0,0,{"$f":"SUM(AB84:AE84)","v":{"$error":"#REF!"}},null,0,0,0,0,{"$f":"SUM(AH84:AK84)","v":0},null,0,0,null,0,{"$f":"SUM(AN84:AQ84)","v":0},null,0,0,null,0,{"$f":"SUM(AT84:AW84)","v":0},null,"BN18:BP19","Wilderness Fight Time Hours"]
[null,"Wilderness Landings",null,{"$error":"#REF!"},0,{"$error":"#REF!"},0,{"$f":"SUM(D85:G85)","v":{"$error":"#REF!"}},null,0,0,{"$f":"SUM(#REF!,#REF!,#REF!)","v":{"$error":"#REF!"}},0,{"$f":"SUM(J85:M85)","v":{"$error":"#REF!"}},null,{"$f":"SUM(#REF!)","v":{"$error":"#REF!"}},0,0,0,{"$f":"SUM(P85:S85)","v":{"$error":"#REF!"}},null,{"$f":"SUM(#REF!,#REF!)","v":{"$error":"#REF!"}},0,0,0,{"$f":"SUM(V85:Y85)","v":{"$error":"#REF!"}},null,{"$f":"SUM(#REF!,#REF!,#REF!)","v":{"$error":"#REF!"}},0,0,0,{"$f":"SUM(AB85:AE85)","v":{"$error":"#REF!"}},null,0,0,0,0,{"$f":"SUM(AH85:AK85)","v":0},null,0,0,null,0,{"$f":"SUM(AN85:AQ85)","v":0},null,0,0,null,0,{"$f":"SUM(AT85:AW85)","v":0},null,"BN20:BP21","Wilderness Landings"]
[null,"Wilderness Ext. Load Deliveries & Pickups",null,{"$error":"#REF!"},0,{"$error":"#REF!"},0,{"$f":"SUM(D86:G86)","v":{"$error":"#REF!"}},null,0,0,{"$f":"SUM(#REF!,#REF!,#REF!)","v":{"$error":"#REF!"}},0,{"$f":"SUM(J86:M86)","v":{"$error":"#REF!"}},null,{"$f":"SUM(#REF!)","v":{"$error":"#REF!"}},0,0,0,{"$f":"SUM(P86:S86)","v":{"$error":"#REF!"}},null,{"$f":"SUM(#REF!,#REF!)","v":{"$error":"#REF!"}},0,0,0,{"$f":"SUM(V86:Y86)","v":{"$error":"#REF!"}},null,{"$f":"SUM(#REF!,#REF!,#REF!)","v":{"$error":"#REF!"}},0,0,0,{"$f":"SUM(AB86:AE86)","v":{"$error":"#REF!"}},null,0,0,0,0,{"$f":"SUM(AH86:AK86)","v":0},null,0,0,null,0,{"$f":"SUM(AN86:AQ86)","v":0},null,0,0,null,0,{"$f":"SUM(AT86:AW86)","v":0},null,"BN22:BP23","Wilderness Ext. Load Deliveries & Pickups"]
[]
[null,null,{"$f":"$B89","v":"USFS: Mount Baker Snoqualmie NF"},null,null,null,null,null,{"$f":"$B89","v":"USFS: Mount Baker Snoqualmie NF"},null,null,null,null,null,{"$f":"$B89","v":"USFS: Mount Baker Snoqualmie NF"},null,null,null,null,null,{"$f":"$B89","v":"USFS: Mount Baker Snoqualmie NF"},null,null,null,null,null,{"$f":"$B89","v":"USFS: Mount Baker Snoqualmie NF"},null,null,null,null,null,{"$f":"$B89","v":"USFS: Mount Baker Snoqualmie NF"},null,null,null,null,null,{"$f":"$B89","v":"USFS: Mount Baker Snoqualmie NF"},null,null,null,null,null,{"$f":"$B89","v":"USFS: Mount Baker Snoqualmie NF"}]
[null,"USFS: Mount Baker Snoqualmie NF",{"$f":"C2","v":"139-day Contract TOTALS"},null,null,null,null,null,"May",null,null,null,null,null,"June",null,null,null,null,null,"July",null,null,null,null,null,"August",null,null,null,null,null,"September",null,null,null,null,null,"October",null,null,null,null,null,"November"]
[null,null,null,"SAR","Project","Training","Fire","Total",null,"SAR (operational)",null,null,"Fire","Total",null,"SAR (operational)",null,null,"Fire","Total",null,"SAR (operational)",null,null,"Fire","Total",null,"SAR (operational)",null,null,"Fire","Total",null,"SAR (operational)",null,null,"Fire","Total",null,"SAR (operational)",null,null,"Fire","Total",null,"SAR (operational)",null,null,"Fire","Total"]
[null,"Total Cost",null,{"$f":"SUM(J91,P91,V91,AB91,AH91,AN91,AT91)","v":0},{"$f":"SUM(K91,Q91,W91,AC91,AI91,AO91,AU91)","v":0},{"$f":"SUM(L91,R91,X91,AD91,AJ91,AP91,AV91)","v":0},{"$f":"SUM(M91,S91,Y91,AE91,AK91,AQ91,AW91)","v":{"$error":"#REF!"}},{"$f":"SUM(N91,T91,Z91,AF91,AL91,AR91,AX91)","v":{"$error":"#REF!"}},null,{"$f":"J94+J95+J96+J97+J98","v":0},{"$f":"K94+K95+K96+K97+K98","v":0},{"$f":"L94+L95+L96+L97+L98","v":0},{"$f":"M94+M95+M96+M97+M98","v":0},{"$f":"SUM(I91:M91)","v":0},null,{"$f":"P94+P95+P96+P97+P98","v":0},{"$f":"Q94+Q95+Q96+Q97+Q98","v":0},{"$f":"R94+R95+R96+R97+R98","v":0},{"$f":"S94+S95+S96+S97+S98","v":0},{"$f":"SUM(O91:S91)","v":0},null,{"$f":"V94+V95+V96+V97+V98","v":0},{"$f":"W94+W95+W96+W97+W98","v":0},{"$f":"X94+X95+X96+X97+X98","v":0},{"$f":"Y94+Y95+Y96+Y97+Y98","v":0},{"$f":"SUM(U91:Y91)","v":0},null,{"$f":"AB94+AB95+AB96+AB97+AB98","v":0},{"$f":"AC94+AC95+AC96+AC97+AC98","v":0},{"$f":"AD94+AD95+AD96+AD97+AD98","v":0},{"$f":"AE94+AE95+AE96+AE97+AE98","v":{"$error":"#REF!"}},{"$f":"SUM(AA91:AE91)","v":{"$error":"#REF!"}},null,{"$f":"AH94+AH95+AH96+AH97+AH98","v":0},{"$f":"AI94+AI95+AI96+AI97+AI98","v":0},{"$f":"AJ94+AJ95+AJ96+AJ97+AJ98","v":0},{"$f":"AK94+AK95+AK96+AK97+AK98","v":{"$error":"#REF!"}},{"$f":"SUM(AG91:AK91)","v":{"$error":"#REF!"}},null,{"$f":"AN94+AN95+AN96+AN97+AN98","v":0},{"$f":"AO94+AO95+AO96+AO97+AO98","v":0},{"$f":"AP94+AP95+AP96+AP97+AP98","v":0},{"$f":"AQ94+AQ95+AQ96+AQ97+AQ98","v":0},{"$f":"SUM(AM91:AQ91)","v":0},null,{"$f":"AT94+AT95+AT96+AT97+AT98","v":0},{"$f":"AU94+AU95+AU96+AU97+AU98","v":0},{"$f":"AV94+AV95+AV96+AV97+AV98","v":0},{"$f":"AW94+AW95+AW96+AW97+AW98","v":0},{"$f":"SUM(AS91:AW91)","v":0},null,null,"Total Cost"]
[null,"Flight Time Hours",null,{"$f":"SUM(J92,P92,V92,AB92,AH92,AN92,AT92)","v":0},{"$f":"SUM(K92,Q92,W92,AC92,AI92,AO92,AU92)","v":0},{"$f":"SUM(L92,R92,X92,AD92,AJ92,AP92,AV92)","v":0},{"$f":"SUM(M92,S92,Y92,AE92,AK92,AQ92,AW92)","v":{"$error":"#REF!"}},{"$f":"SUM(D92:G92)","v":{"$error":"#REF!"}},null,0,null,null,0,{"$f":"SUM(J92:M92)","v":0},null,0,null,null,0,{"$f":"SUM(P92:S92)","v":0},null,0,null,null,0,{"$f":"SUM(V92:Y92)","v":0},null,0,0,null,{"$f":" SUM(#REF!,#REF!,#REF!,#REF!,#REF!,#REF!,#REF!,#REF!)","v":{"$error":"#REF!"}},{"$f":"SUM(AB92:AE92)","v":{"$error":"#REF!"}},null,0,null,null,{"$f":"SUM(#REF!)","v":{"$error":"#REF!"}},{"$f":"SUM(AH92:AK92)","v":{"$error":"#REF!"}},null,0,null,null,0,{"$f":"SUM(AN92:AQ92)","v":0},null,0,null,null,0,{"$f":"SUM(AT92:AW92)","v":0},null,"AH16:AL17","Flight Time Hours"]
[null,"Flight Time Percentage",null,{"$f":"IF(SUM(D92:G92)=0,0,D92/SUM(D92:G92))","v":{"$error":"#REF!"}},{"$f":"IF(SUM(D92:G92)=0,0,E92/SUM(D92:G92))","v":{"$error":"#REF!"}},{"$f":"IF(SUM(D92:G92)=0,0,F92/SUM(D92:G92))","v":{"$error":"#REF!"}},{"$f":"IF(SUM(D92:G92)=0,0,G92/SUM(D92:G92))","v":{"$error":"#REF!"}},{"$error":"#REF!"},null,{"$f":"IF(SUM(J92,K92,M92)=0,0,J92/SUM(J92,K92,M92))","v":0},null,null,{"$f":"IF(SUM(J92,K92,M92)=0,0,M92/SUM(J92,K92,M92))","v":0},0,null,{"$f":"IF(SUM(P92,Q92,S92)=0,0,P92/SUM(P92,Q92,S92))","v":0},null,null,{"$f":"IF(SUM(P92,Q92,S92)=0,0,S92/SUM(P92,Q92,S92))","v":0},0,null,{"$f":"IF(SUM(V92,W92,Y92)=0,0,V92/SUM(V92,W92,Y92))","v":0},null,null,{"$f":"IF(SUM(V92,W92,Y92)=0,0,Y92/SUM(V92,W92,Y92))","v":0},0,null,{"$f":"IF(SUM(AB92,AC92,AE92)=0,0,AB92/SUM(AB92,AC92,AE92))","v":{"$error":"#REF!"}},null,null,{"$f":"IF(SUM(AB92,AC92,AE92)=0,0,AE92/SUM(AB92,AC92,AE92))","v":{"$error":"#REF!"}},{"$error":"#REF!"},null,{"$f":"IF(SUM(AH92,AI92,AK92)=0,0,AH92/SUM(AH92,AI92,AK92))","v":{"$error":"#REF!"}},null,null,{"$f":"IF(SUM(AH92,AI92,AK92)=0,0,AK92/SUM(AH92,AI92,AK92))","v":{"$error":"#REF!"}},{"$error":"#REF!"},null,{"$f":"IF(SUM(AN92,AO92,AQ92)=0,0,AN92/SUM(AN92,AO92,AQ92))","v":0},null,null,{"$f":"IF(SUM(AN92,AO92,AQ92)=0,0,AQ92/SUM(AN92,AO92,AQ92))","v":0},0,null,{"$f":"IF(SUM(AT92,AU92,AW92)=0,0,AT92/SUM(AT92,AU92,AW92))","v":0},null,null,{"$f":"IF(SUM(AT92,AU92,AW92)=0,0,AW92/SUM(AT92,AU92,AW92))","v":0},0,null,null,"Flight Time Percentage"]
[null,"Flight Time Cost",null,{"$f":"SUM(J94,P94,V94,AB94,AH94,AN94,AT94)","v":0},0,0,{"$error":"#REF!"},{"$error":"#REF!"},null,{"$f":"J92*'Contract Info'!$D$18","v":0},null,null,{"$f":"M92*'Contract Info'!$D$18","v":0},0,null,{"$f":"P92*'Contract Info'!$D$18","v":0},null,null,{"$f":"S92*'Contract Info'!$D$18","v":0},0,null,{"$f":"V92*'Contract Info'!$D$18","v":0},null,null,{"$f":"Y92*'Contract Info'!$D$18","v":0},0,null,{"$f":"AB92*'Contract Info'!$D$18","v":0},null,null,{"$f":"AE92*'Contract Info'!$D$18","v":{"$error":"#REF!"}},{"$error":"#REF!"},null,{"$f":"AH92*'Contract Info'!$D$18","v":0},null,null,{"$f":"AK92*'Contract Info'!$D$18","v":{"$error":"#REF!"}},{"$error":"#REF!"},null,{"$f":"AN92*'Contract Info'!$D$18","v":0},null,null,{"$f":"AQ92*'Contract Info'!$D$18","v":0},0,null,{"$f":"AT92*'Contract Info'!$D$18","v":0},null,null,{"$f":"AW92*'Contract Info'!$D$18","v":0},0,null,null,"Flight Time Cost"]
[null,"Extended Standby Cost",null,0,0,0,{"$error":"#REF!"},{"$error":"#REF!"},null,0,null,null,0,0,null,0,null,null,0,0,null,0,null,null,0,0,null,0,null,null,{"$f":" SUM(#REF!,#REF!,#REF!,#REF!,#REF!,#REF!,#REF!,#REF!)","v":{"$error":"#REF!"}},{"$error":"#REF!"},null,0,null,null,{"$f":"SUM(#REF!)","v":{"$error":"#REF!"}},{"$error":"#REF!"},null,0,null,null,0,0,null,0,null,null,0,0,null,"AS20:AX25","Extended Standby Cost"]
[null,"Per Diem Cost",null,0,0,0,{"$error":"#REF!"},{"$error":"#REF!"},null,0,null,null,0,0,null,0,null,null,0,0,null,0,null,null,0,0,null,0,null,null,{"$f":" SUM(#REF!,#REF!,#REF!,#REF!,#REF!,#REF!,#REF!,#REF!)","v":{"$error":"#REF!"}},{"$error":"#REF!"},null,0,null,null,{"$f":"SUM(#REF!)","v":{"$error":"#REF!"}},{"$error":"#REF!"},null,0,null,null,0,0,null,0,null,null,0,0,null,"AS26:AX27","Per Diem Cost"]
[null,"Service Truck Mileage Cost",null,0,0,0,{"$error":"#REF!"},{"$error":"#REF!"},null,0,null,null,0,0,null,0,null,null,0,0,null,0,null,null,0,0,null,0,null,null,{"$f":" SUM(#REF!,#REF!,#REF!,#REF!,#REF!,#REF!,#REF!,#REF!)","v":{"$error":"#REF!"}},{"$error":"#REF!"},null,0,null,null,{"$f":"SUM(#REF!)","v":{"$error":"#REF!"}},{"$error":"#REF!"},null,0,null,null,0,0,null,0,null,null,0,0,null,"AS28:AX29","Service Truck Mileage Cost"]
[null,"Relief Travel Cost & Other Special Charges",null,null,null,null,null,{"$f":"SUM(D98:G98)","v":0},null,null,null,null,null,{"$f":"SUM(J98:M98)","v":0},null,null,null,null,null,{"$f":"SUM(P98:S98)","v":0},null,null,null,null,null,{"$f":"SUM(V98:Y98)","v":0},null,null,null,null,null,{"$f":"SUM(AB98:AE98)","v":0},null,null,null,null,null,{"$f":"SUM(AH98:AK98)","v":0},null,null,null,null,null,{"$f":"SUM(AN98:AQ98)","v":0},null,null,null,null,null,{"$f":"SUM(AT98:AW98)","v":0},null,"AS32:AX37","Relief Travel Cost & Other Special Charges"]
[null,"Passengers Transported",null,0,0,0,{"$error":"#REF!"},{"$error":"#REF!"},null,0,0,null,0,0,null,0,0,null,0,0,null,0,0,null,0,0,null,0,0,null,{"$f":" SUM(#REF!,#REF!,#REF!,#REF!,#REF!,#REF!,#REF!,#REF!)","v":{"$error":"#REF!"}},{"$error":"#REF!"},null,0,0,null,{"$f":"SUM(#REF!)","v":{"$error":"#REF!"}},{"$error":"#REF!"},null,0,0,null,0,0,null,0,0,null,0,0,null,"V43:Z44","Passengers Transported"]
[null,"Cargo Transported (lbs.)",null,0,0,0,{"$error":"#REF!"},{"$error":"#REF!"},null,0,null,null,0,0,null,0,null,null,0,0,null,0,null,null,0,0,null,0,null,null,{"$f":" SUM(#REF!,#REF!,#REF!,#REF!,#REF!,#REF!,#REF!,#REF!)","v":{"$error":"#REF!"}},{"$error":"#REF!"},null,0,null,null,{"$f":"SUM(#REF!)","v":{"$error":"#REF!"}},{"$error":"#REF!"},null,0,null,null,0,0,null,0,null,null,0,0,null,"AA43:AF44","Cargo Transported (lbs.)"]
[null,"Water Dropped (gal.)",null,null,null,null,{"$f":"SUM(M101,S101,Y101,AE101,AK101,AQ101,AW101)","v":{"$error":"#REF!"}},{"$error":"#REF!"},null,null,null,null,0,0,null,null,null,null,0,0,null,null,null,null,0,0,null,null,null,null,{"$f":" SUM(#REF!,#REF!,#REF!,#REF!,#REF!,#REF!,#REF!,#REF!)","v":{"$error":"#REF!"}},{"$error":"#REF!"},null,null,null,null,{"$f":"SUM(#REF!)","v":{"$error":"#REF!"}},{"$error":"#REF!"},null,null,null,null,0,0,null,null,null,null,0,0,null,"AG43:AL44","Water Dropped (gal.)"]
[null,"Initial Attacks",null,null,null,null,{"$f":"SUM(M102,S102,Y102,AE102,AK102,AQ102,AW102)","v":0},0,null,null,null,null,0,{"$f":"M102","v":0},null,null,null,null,0,null,null,null,null,null,0,null,null,null,null,null,0,0,null,null,null,null,0,0,null,null,null,null,null,0,null,null,null,null,null,0,null,null,"Initial Attacks"]
[null,"SARs, Projects, Training & Fires Supported",null,{"$f":"SUM(J103,P103,V103,AB103,AH103,AN103,AT103)","v":0},{"$f":"SUM(K103,Q103,W103,AC103,AI103,AO103,AU103)","v":0},{"$f":"SUM(L103,R103,X103,AD103,AJ103,AP103,AV103)","v":0},{"$f":"SUM(M103,S103,Y103,AE103,AK103,AQ103,AW103)","v":3},null,null,null,null,null,0,null,null,null,null,null,0,null,null,null,null,null,0,null,null,0,null,null,2,null,null,0,null,null,1,null,null,0,null,null,null,null,null,0,null,null,null,null,null,null,"SARs, Projects, Training & Fires Supported"]
[null,null,null,null,null,null,null,null,null,null,null,null,null,null,null,null,null,null,null,null,null,null,null,null,null,null,null,null,null,null,null,null,null,null,null,null,null,null,null,null,null,null,null,null,null,null,null,null,null,null,null,"BN18:BP19","Wilderness Fight Time Hours"]
[null,"Totals by unit",null,"MORA","NOCA","NOCA","OLYM","USFS / OWF"]
[null,"Days at each NPS or USFS Unit",null,{"$f":"#REF!","v":{"$error":"#REF!"}},{"$f":"#REF!","v":{"$error":"#REF!"}},{"$f":"#REF!","v":{"$error":"#REF!"}},{"$f":"#REF!","v":{"$error":"#REF!"}},{"$f":"#REF!","v":{"$error":"#REF!"}}]
[null,"SARs involving short-haul at each Unit",null,5,2,2,1,1]
[]
[]
[null,null,{"$f":"$B111","v":"Other NPS"},null,null,null,null,null,{"$f":"$B111","v":"Other NPS"},null,null,null,null,null,{"$f":"$I$88","v":"USFS: Mount Baker Snoqualmie NF"},null,null,null,null,null,{"$f":"$B111","v":"Other NPS"},null,null,null,null,null,{"$f":"$B111","v":"Other NPS"},null,null,null,null,null,{"$f":"$B111","v":"Other NPS"},null,null,null,null,null,{"$f":"$B111","v":"Other NPS"},null,null,null,null,null,{"$f":"$B111","v":"Other NPS"}]
[null,"Other NPS","120-day Contract TOTALS",null,null,null,null,null,"May",null,null,null,null,null,"June",null,null,null,null,null,"July",null,null,null,null,null,"August",null,null,null,null,null,"September",null,null,null,null,null,"October",null,null,null,null,null,"November"]
[null,null,null,"SAR","Project","Training","Fire","Total",null,"SAR (operational)","Project","Training","Fire","Total",null,"SAR (operational)","Project","Training","Fire","Total",null,"SAR (operational)","Project","Training","Fire","Total",null,"SAR (operational)","Project","Training","Fire","Total",null,"SAR (operational)","Project","Training","Fire","Total",null,"SAR (operational)","Project",null,"Fire","Total",null,"SAR (operational)","Project",null,"Fire","Total"]
[null,"Total Cost",null,{"$f":"SUM(J113,P113,V113,AB113,AH113,AN113,AT113)","v":0},{"$f":"SUM(K113,Q113,W113,AC113,AI113,AO113,AU113)","v":0},{"$f":"SUM(L113,R113,X113,AD113,AJ113,AP113,AV113)","v":0},{"$f":"SUM(M113,S113,Y113,AE113,AK113,AQ113,AW113)","v":0},{"$f":"SUM(N113,T113,Z113,AF113,AL113,AR113,AX113)","v":0},null,{"$f":"J116+J117+J118+J119+J120","v":0},{"$f":"K116+K117+K118+K119+K120","v":0},null,{"$f":"M116+M117+M118+M119+M120","v":0},{"$f":"SUM(I113:M113)","v":0},null,{"$f":"P116+P117+P118+P119+P120","v":0},{"$f":"Q116+Q117+Q118+Q119+Q120","v":0},null,{"$f":"S116+S117+S118+S119+S120","v":0},{"$f":"SUM(O113:S113)","v":0},null,{"$f":"V116+V117+V118+V119+V120","v":0},{"$f":"W116+W117+W118+W119+W120","v":0},null,{"$f":"Y116+Y117+Y118+Y119+Y120","v":0},{"$f":"SUM(U113:Y113)","v":0},null,{"$f":"AB116+AB117+AB118+AB119+AB120","v":0},{"$f":"AC116+AC117+AC118+AC119+AC120","v":0},null,{"$f":"AE116+AE117+AE118+AE119+AE120","v":0},{"$f":"SUM(AA113:AE113)","v":0},null,{"$f":"AH116+AH117+AH118+AH119+AH120","v":0},{"$f":"AI116+AI117+AI118+AI119+AI120","v":0},null,{"$f":"AK116+AK117+AK118+AK119+AK120","v":0},{"$f":"SUM(AG113:AK113)","v":0},null,{"$f":"AN116+AN117+AN118+AN119+AN120","v":0},{"$f":"AO116+AO117+AO118+AO119+AO120","v":0},null,{"$f":"AQ116+AQ117+AQ118+AQ119+AQ120","v":0},{"$f":"SUM(AM113:AQ113)","v":0},null,{"$f":"AT116+AT117+AT118+AT119+AT120","v":0},{"$f":"AU116+AU117+AU118+AU119+AU120","v":0},null,{"$f":"AW116+AW117+AW118+AW119+AW120","v":0},{"$f":"SUM(AS113:AW113)","v":0},null,null,"Total Cost"]
[null,"Flight Time Hours",null,{"$f":"SUM(J114,P114,V114,AB114,AH114,AN114,AT114)","v":0},{"$f":"SUM(K114,Q114,W114,AC114,AI114,AO114,AU114)","v":0},{"$f":"SUM(L114,R114,X114,AD114,AJ114,AP114,AV114)","v":0},{"$f":"SUM(M114,S114,Y114,AE114,AK114,AQ114,AW114)","v":0},{"$f":"SUM(D114:G114)","v":0},null,0,0,null,0,{"$f":"SUM(J114:M114)","v":0},null,0,0,null,0,{"$f":"SUM(P114:S114)","v":0},null,0,0,null,0,{"$f":"SUM(V114:Y114)","v":0},null,0,0,null,0,{"$f":"SUM(AB114:AE114)","v":0},null,0,0,null,0,{"$f":"SUM(AH114:AK114)","v":0},null,0,0,null,0,{"$f":"SUM(AN114:AQ114)","v":0},null,0,0,null,0,{"$f":"SUM(AT114:AW114)","v":0},null,"AH16:AL17","Flight Time Hours"]
[null,"Flight Time Percentage",null,{"$f":"IF(SUM(D114:G114)=0,0,D114/SUM(D114:G114))","v":0},{"$f":"IF(SUM(D114:G114)=0,0,E114/SUM(D114:G114))","v":0},{"$f":"IF(SUM(D114:G114)=0,0,F114/SUM(D114:G114))","v":0},{"$f":"IF(SUM(D114:G114)=0,0,G114/SUM(D114:G114))","v":0},{"$f":"SUM(D115:G115)","v":0},null,{"$f":"IF(SUM(J114:M114)=0,0,J114/SUM(J114:M114))","v":0},{"$f":"IF(SUM(J114:M114)=0,0,K114/SUM(J114:M114))","v":0},{"$f":"IF(SUM(J114:M114)=0,0,L114/SUM(J114:M114))","v":0},{"$f":"IF(SUM(J114:M114)=0,0,M114/SUM(J114:M114))","v":0},{"$f":"SUM(J115:M115)","v":0},null,{"$f":"IF(SUM(P114:S114)=0,0,P114/SUM(P114:S114))","v":0},{"$f":"IF(SUM(P114:S114)=0,0,Q114/SUM(P114:S114))","v":0},{"$f":"IF(SUM(P114:S114)=0,0,R114/SUM(P114:S114))","v":0},{"$f":"IF(SUM(P114:S114)=0,0,S114/SUM(P114:S114))","v":0},0,null,{"$f":"IF(SUM(V114:Y114)=0,0,V114/SUM(V114:Y114))","v":0},{"$f":"IF(SUM(V114:Y114)=0,0,W114/SUM(V114:Y114))","v":0},{"$f":"IF(SUM(V114:Y114)=0,0,X114/SUM(V114:Y114))","v":0},{"$f":"IF(SUM(V114:Y114)=0,0,Y114/SUM(V114:Y114))","v":0},0,null,{"$f":"IF(SUM(AB114:AE114)=0,0,AB114/SUM(AB114:AE114))","v":0},{"$f":"IF(SUM(AB114:AE114)=0,0,AC114/SUM(AB114:AE114))","v":0},{"$f":"IF(SUM(AB114:AE114)=0,0,AD114/SUM(AB114:AE114))","v":0},{"$f":"IF(SUM(AB114:AE114)=0,0,AE114/SUM(AB114:AE114))","v":0},0,null,{"$f":"IF(SUM(AH114:AK114)=0,0,AH114/SUM(AH114:AK114))","v":0},{"$f":"IF(SUM(AH114:AK114)=0,0,AI114/SUM(AH114:AK114))","v":0},{"$f":"IF(SUM(AH114:AK114)=0,0,AJ114/SUM(AH114:AK114))","v":0},{"$f":"IF(SUM(AH114:AK114)=0,0,AK114/SUM(AH114:AK114))","v":0},{"$f":"SUM(AH115:AK115)","v":0},null,{"$f":"IF(SUM(AN114:AQ114)=0,0,AN114/SUM(AN114:AQ114))","v":0},{"$f":"IF(SUM(AN114:AQ114)=0,0,AO114/SUM(AN114:AQ114))","v":0},{"$f":"IF(SUM(AN114:AQ114)=0,0,AP114/SUM(AN114:AQ114))","v":0},{"$f":"IF(SUM(AN114:AQ114)=0,0,AQ114/SUM(AN114:AQ114))","v":0},{"$f":"SUM(AN115:AQ115)","v":0},null,{"$f":"IF(SUM(AT114:AW114)=0,0,AT114/SUM(AT114:AW114))","v":0},{"$f":"IF(SUM(AT114:AW114)=0,0,AU114/SUM(AT114:AW114))","v":0},{"$f":"IF(SUM(AT114:AW114)=0,0,AV114/SUM(AT114:AW114))","v":0},{"$f":"IF(SUM(AT114:AW114)=0,0,AW114/SUM(AT114:AW114))","v":0},{"$f":"SUM(AT115:AW115)","v":0},null,null,"Flight Time Percentage"]
[null,"Flight Time Cost",null,{"$f":"SUM(J116,P116,V116,AB116,AH116,AN116,AT116)","v":0},0,0,0,{"$f":"SUM(D116:G116)","v":0},null,{"$f":"J114*'Contract Info'!$D$18","v":0},{"$f":"K114*'Contract Info'!$D$18","v":0},null,{"$f":"M114*'Contract Info'!$D$18","v":0},0,null,{"$f":"P114*'Contract Info'!$D$18","v":0},{"$f":"Q114*'Contract Info'!$D$18","v":0},null,{"$f":"S114*'Contract Info'!$D$18","v":0},0,null,{"$f":"V114*'Contract Info'!$D$18","v":0},{"$f":"W114*'Contract Info'!$D$18","v":0},null,{"$f":"Y114*'Contract Info'!$D$18","v":0},0,null,{"$f":"AB114*'Contract Info'!$D$18","v":0},{"$f":"AC114*'Contract Info'!$D$18","v":0},null,{"$f":"AE114*'Contract Info'!$D$18","v":0},0,null,{"$f":"AH114*'Contract Info'!$D$18","v":0},{"$f":"AI114*'Contract Info'!$D$18","v":0},null,{"$f":"AK114*'Contract Info'!$D$18","v":0},0,null,{"$f":"AN114*'Contract Info'!$D$18","v":0},{"$f":"AO114*'Contract Info'!$D$18","v":0},null,{"$f":"AQ114*'Contract Info'!$D$18","v":0},0,null,{"$f":"AT114*'Contract Info'!$D$18","v":0},{"$f":"AU114*'Contract Info'!$D$18","v":0},null,{"$f":"AW114*'Contract Info'!$D$18","v":0},0,null,null,"Flight Time Cost"]
[null,"Extended Standby Cost",null,0,0,0,0,0,null,0,0,null,0,0,null,0,0,null,0,0,null,0,0,null,0,0,null,0,0,null,0,0,null,0,0,null,0,0,null,0,0,null,0,0,null,0,0,null,0,0,null,"AS20:AX25","Extended Standby Cost"]
[null,"Per Diem Cost",null,0,0,0,0,0,null,0,0,null,0,0,null,0,0,null,0,0,null,0,0,null,0,0,null,0,0,null,0,0,null,0,0,null,0,0,null,0,0,null,0,0,null,0,0,null,0,0,null,"AS26:AX27","Per Diem Cost"]
[null,"Service Truck Mileage Cost",null,0,0,0,0,0,null,0,0,null,0,0,null,0,0,null,0,0,null,0,0,null,0,0,null,0,0,null,0,0,null,0,0,null,0,0,null,0,0,null,0,0,null,0,0,null,0,0,null,"AS28:AX29","Service Truck Mileage Cost"]
[null,"Relief Travel Cost & Other Special Charges",null,null,null,null,null,{"$f":"SUM(D120:G120)","v":0},null,null,null,null,null,{"$f":"SUM(J120:M120)","v":0},null,null,null,null,null,{"$f":"SUM(P120:S120)","v":0},null,null,null,null,null,{"$f":"SUM(V120:Y120)","v":0},null,null,null,null,null,{"$f":"SUM(AB120:AE120)","v":0},null,null,null,null,null,0,null,null,null,null,null,0,null,null,null,null,null,0,null,null,"Relief Travel Cost"]
[null,"Passengers transported",null,0,0,0,0,0,null,0,0,null,0,0,null,0,0,null,0,0,null,0,0,null,0,0,null,0,0,null,0,0,null,0,0,null,0,0,null,0,0,null,0,0,null,0,0,null,0,0,null,"V43:Z44","Passengers transported"]
[null,"Cargo transported (lbs.)",null,0,0,0,0,0,null,0,0,null,0,0,null,0,0,null,0,0,null,0,0,null,0,0,null,0,0,null,0,0,null,0,0,null,0,0,null,0,0,null,0,0,null,0,0,null,0,0,null,"AA43:AF44","Cargo transported (lbs.)"]
[null,"Water dropped (gal.)",null,null,null,null,{"$f":"SUM(M123,S123,Y123,AE123,AK123,AQ123,AW123)","v":0},0,null,null,null,null,0,0,null,null,null,null,0,0,null,null,null,null,0,0,null,null,null,null,0,0,null,null,null,null,0,0,null,null,null,null,0,0,null,null,null,null,0,0,null,"AG43:AL44","Water dropped (gal.)"]
[null,"Initial Attacks",null,null,null,null,{"$f":"SUM(M124,S124,Y124,AE124,AK124,AQ124,AW124)","v":0},0,null,null,null,null,0,{"$f":"M124","v":0},null,null,null,null,0,null,null,null,null,null,0,null,null,null,null,null,0,0,null,null,null,null,0,0,null,null,null,null,0,0,null,null,null,null,0,0,null,null,"Initial Attacks"]
[null,"SARs, Projects & Fires supported",null,{"$f":"SUM(J125,P125,V125,AB125,AH125,AN125,AT125)","v":0},{"$f":"SUM(K125,Q125,W125,AC125,AI125,AO125,AU125)","v":0},{"$f":"SUM(L125,R125,X125,AD125,AJ125,AP125,AV125)","v":0},{"$f":"SUM(M125,S125,Y125,AE125,AK125,AQ125,AW125)","v":0},null,null,0,0,null,0,null,null,0,0,null,0,null,null,0,0,null,0,null,null,0,0,null,0,null,null,0,0,null,0,null,null,0,0,null,0,null,null,0,0,null,0,null,null,null,"SARs, Projects & Fires supported"]
[null,null,null,null,null,null,null,null,null,null,null,null,null,null,null,null,null,null,null,null,null,null,null,null,null,null,null,null,null,null,null,null,null,null,null,null,null,null,null,null,null,null,null,null,null,null,null,null,null,null,null,"BN18:BP19","Wilderness Fight Time Hours"]
[null,"Totals by unit","Total All Units","MORA","NOCA","NOCA","OLYM","USFS / OWF",null,null,null,null,null,null,null,null,null,null,null,null,null,null,null,null,null,null,null,null,null,null,null,null,null,null,null,null,null,null,null,null,null,null,null,null,null,null,null,null,null,null,null,"BN20:BP21","Wilderness Landings"]
[null,"Days at each NPS or USFS Unit",{"$f":"SUM(D128:H128)","v":{"$error":"#REF!"}},{"$f":"#REF!","v":{"$error":"#REF!"}},{"$f":"#REF!","v":{"$error":"#REF!"}},{"$f":"#REF!","v":{"$error":"#REF!"}},{"$f":"#REF!","v":{"$error":"#REF!"}},{"$f":"#REF!","v":{"$error":"#REF!"}},null,null,null,null,null,null,null,null,null,null,null,null,null,null,null,null,null,null,null,null,null,null,null,null,null,null,null,null,null,null,null,null,null,null,null,null,null,null,null,null,null,null,null,"BN22:BP23","Wilderness Deliveries"]
[null,"SARs involving short-haul at each Unit",null,null,null,null,null,null,null,null,null,null,null,null,null,null,null,null,null,null,null,null,null,null,null,null,null,null,null,null,null,null,null,null,null,null,null,null,null,null,null,null,null,null,null,null,null,null,null,null,null,"BN20:BP21","Wilderness Landings"]
[null,null,null,null,null,null,null,null,null,null,null,null,null,null,null,null,null,null,null,null,null,null,null,null,null,null,null,null,null,null,null,null,null,null,null,null,null,null,null,null,null,null,null,null,null,null,null,null,null,null,null,"BN22:BP23","Wilderness Deliveries"]
[null,"Unit Statistics","NPS or USFS Unit"]
[null,null,"MORA","NOCA","OLYM","FS MBS","Other NPS","Total"]
[null,"Total Cost to Unit",{"$f":"H31","v":{"$error":"#REF!"}},{"$f":"H51","v":{"$error":"#REF!"}},{"$f":"H71","v":{"$error":"#REF!"}},{"$f":"H91","v":{"$error":"#REF!"}},{"$f":"H113","v":0},{"$f":"SUM(C133:G133)","v":{"$error":"#REF!"}}]
[null,"Flight Time Hours",{"$f":"H32","v":{"$error":"#REF!"}},{"$f":"H52","v":{"$error":"#REF!"}},{"$f":"H72","v":{"$error":"#REF!"}},{"$f":"H92","v":{"$error":"#REF!"}},{"$f":"H114","v":0},{"$f":"SUM(C134:G134)","v":{"$error":"#REF!"}}]
[null,"Flight Time Percentage",{"$f":"C134/$H$134","v":{"$error":"#REF!"}},{"$f":"D134/$H$134","v":{"$error":"#REF!"}},{"$f":"E134/$H$134","v":{"$error":"#REF!"}},{"$f":"F134/$H$134","v":{"$error":"#REF!"}},{"$f":"G134/$H$134","v":{"$error":"#REF!"}},{"$f":"SUM(C135:G135)","v":{"$error":"#REF!"}}]

{"sheet":"Contract Total Overview","index":3,"n_rows":134,"n_cols":8,"rows_kept":134,"cut":false,"hidden":false,"merged":[[0,0,0,7],[1,2,1,7],[129,2,129,7],[67,2,67,7],[48,2,48,7],[47,2,47,7],[28,2,28,7],[27,2,27,7],[109,2,109,7],[88,2,88,7],[87,2,87,7],[68,2,68,7]]}
["2021 NW Exclusive Use Contract Totals  (May 2 thru Sep 17)"]
[null,"TOTALS FOR ALL LOCATIONS","139-day Contract TOTALS"]
[null,"All Parks & other locations","Availability","SAR","Project","Training","Fire","Total"]
[null,"Total Cost",466085,51714.899999999587,51150.650000000256,30718.899999999587,76486.750000000553,676156.2]
[null,"Availability Cost",466085,466085,0,0,0,466085]
[null,"Availability Days",null,137.28571428571428,0,0,0,137.28571428571428]
[null,"Flight Time Hours",null,42.899999999999636,43.000000000000227,25.399999999999636,47.7000000000005,159]
[null,"Flight Time Percentage",null,0.2698113207547147,0.27044025157232848,0.15974842767295369,0.30000000000000315,1]
[null,"Flight Time Cost",null,48519.899999999587,48633.000000000255,28727.399999999587,53948.700000000565,179829]
[null,"Extended Standby Cost",null,2113,104,260,9354,11831]
[null,"Per Diem Cost",null,151,755,1266,11790,13962]
[null,"Service Truck Mileage Cost",null,931.00000000000011,1658.65,465.50000000000006,1394.0500000000002,4449.2000000000007]
[null,"Relief Travel Cost & Other Special Charges",null,0,0,0,0,0]
[null,"Passengers transported",null,228,64,162,156,610]
[null,"Cargo transported (lbs.)",null,17844,88324,17970,21277,145415]
[null,"Water dropped (gal.)",null,null,null,null,0,0]
[null,"Initial Attacks",null,null,null,null,1,1]
[null,"SARs, Projects, Training & Fires Supported",null,23,13,28,10]
[null,"Wilderness Fight Time Hours",null,14.6,31.4,5.5,41.900000000000006,93.4]
[null,"Wilderness Landings",null,25,6,13,44,88]
[null,"Wilderness Deliveries"," ",27,32,7,29,95]
[]
[null,"Totals by unit","All Units","MORA","NOCA","OLYM","USFS/OWF","Other"]
[null,"Days (or partial days) at each unit",null,{"$f":"SUM('Task Order Totals'!AL5)","v":99},{"$f":"SUM('Task Order Totals'!AM5)","v":55},{"$f":"SUM('Task Order Totals'!AN5)","v":8},{"$f":"SUM('Task Order Totals'!AO5)","v":9},{"$f":"SUM('Task Order Totals'!AP5)","v":0}]
[null,"SARs involving short-haul at each Unit",{"$f":"SUM(D25:H25)","v":12},4,5,3,0,0]
[null,"check figures"]
[]
[null,null,{"$f":"$B29","v":"MOUNT RAINIER NP"}]
[null,"MOUNT RAINIER NP",{"$f":"C2","v":"139-day Contract TOTALS"}]
[null,null,null,"SAR","Project","Training","Fire","Total"]
[null,"Total Cost",null,18351.299999999432,32276.550000000156,20131.79999999969,0,70759.649999999281]
[null,"Flight Time Hours",null,14.7999999999995,28.100000000000136,17.799999999999727,0,60.699999999999363]
[null,"Flight Time Percentage",null,0.24382207578253137,0.46293245469522953,0.29324546952223912,0,1]
[null,"Flight Time Cost",null,16738.799999999435,31781.100000000155,20131.79999999969,0,68651.699999999284]
[null,"Extended Standby Cost",null,1147,52,0,0,1199]
[null,"Per Diem Cost",null,0,0,0,0,0]
[null,"Service Truck Mileage Cost",null,465.50000000000006,443.45,0,0,908.95]
[null,"Relief Travel Cost & Other Special Charges",null,null,null,null,null,0]
[null,"Passengers Transported",null,86,44,144,0,274]
[null,"Cargo Transported (lbs.)",null,5392,67724,13263,0,86379]
[null,"Water Dropped (gal.)",null,null,null,null,0,0]
[null,"Initial Attacks",null,null,null,null,0,0]
[null,"SARs, Projects, Training & Fires Supported",null,13,10,22,0]
[null,"Wilderness Fight Time Hours",null,5.7,20.900000000000002,5.5,0,32.1]
[null,"Wilderness Landings",null,11,0,13,0,24]
[null,"Wilderness Ext. Load Deliveries & Pickups",null,7,17,7,0,31]
[null,null,null,{"$f":"D51+D71+D91+D115+D136","v":{"$error":"#REF!"}}]
[null,null,{"$f":"B49","v":"NORTH CASCADES NP"}]
[null,"NORTH CASCADES NP",{"$f":"C2","v":"139-day Contract TOTALS"}]
[null,null,null,"SAR","Project","Training","Fire","Total"]
[null,"Total Cost",null,16297.800000000207,18874.100000000104,5372.8999999998459,63932.650000000671,104477.45000000084]
[null,"Flight Time Hours",null,13.300000000000182,14.900000000000091,3.3999999999998636,36.600000000000591,68.200000000000728]
[null,"Flight Time Percentage",null,0.19501466275659882,0.21847507331378199,4.985337243401506E-2,0.53665689149560414,1]
[null,"Flight Time Cost",null,15042.300000000207,16851.900000000103,3845.3999999998459,41394.600000000668,77134.200000000827]
[null,"Extended Standby Cost",null,639,52,156,9354,10201]
[null,"Per Diem Cost",null,151,755,906,11790,13602]
[null,"Service Truck Mileage Cost",null,465.50000000000006,1215.2,465.50000000000006,1394.0500000000002,3540.2500000000005]
[null,"Relief Travel Cost & Other Special Charges",null,null,null,null,null,0]
[null,"Passengers Transported",null,75,20,12,126,233]
[null,"Cargo Transported (lbs.)",null,5950,20600,4017,19308,49875]
[null,"Water Dropped (gal.)",null,null,null,null,0,0]
[null,"Initial Attacks",null,null,null,null,1,1]
[null,"SARs, Projects, Training & Fires Supported",null,6,3,3,7]
[null,"Wilderness Fight Time Hours",null,5.5,10.5,0,31.600000000000005,47.600000000000009]
[null,"Wilderness Landings",null,9,6,0,38,53]
[null,"Wilderness Ext. Load Deliveries & Pickups",null,15,15,0,27,57]
[]
[null,null,{"$f":"$B69","v":"OLYMPIC NP"}]
[null,"OLYMPIC NP",{"$f":"C2","v":"139-day Contract TOTALS"}]
[null,null,null,"SAR","Project","Training","Fire","Total"]
[null,"Total Cost",null,17065.799999999948,0,5214.2000000000517,0,22280]
[null,"Flight Time Hours",null,14.799999999999955,0,4.2000000000000455,0,19]
[null,"Flight Time Percentage",null,0.77894736842105028,0,0.22105263157894975,0,1]
[null,"Flight Time Cost",null,16738.799999999948,0,4750.2000000000517,0,21489]
[null,"Extended Standby Cost",null,327,0,104,0,431]
[null,"Per Diem Cost",null,0,0,360,0,360]
[null,"Service Truck Mileage Cost",null,0,0,0,0,0]
[null,"Relief Travel Cost & Other Special Charges",null,null,null,null,null,0]
[null,"Passengers Transported",null,67,0,6,0,73]
[null,"Cargo Transported (lbs.)",null,6502,0,690,0,7192]
[null,"Water Dropped (gal.)",null,null,null,null,0,0]
[null,"Initial Attacks",null,null,null,null,0,0]
[null,"SARs, Projects, Training & Fires Supported",null,6,0,3,0]
[null,"Wilderness Fight Time Hours",null,3.4,0,0,0,3.4]
[null,"Wilderness Landings",null,5,0,0,0,5]
[null,"Wilderness Ext. Load Deliveries & Pickups",null,5,0,0,0,5]
[]
[null,null,{"$f":"$B89","v":"USFS: Mount Baker Snoqualmie NF"}]
[null,"USFS: Mount Baker Snoqualmie NF",{"$f":"C2","v":"139-day Contract TOTALS"}]
[null,null,null,"SAR","Project","Training","Fire","Total"]
[null,"Total Cost",null,0,0,0,12554.099999999897,12554.099999999897]
[null,"Flight Time Hours",null,0,0,0,11.099999999999909,11.099999999999909]
[null,"Flight Time Percentage",null,0,0,0,1,1]
[null,"Flight Time Cost",null,0,0,0,12554.099999999897,12554.099999999897]
[null,"Extended Standby Cost",null,0,0,0,0,0]
[null,"Per Diem Cost",null,0,0,0,0,0]
[null,"Service Truck Mileage Cost",null,0,0,0,0,0]
[null,"Relief Travel Cost & Other Special Charges",null,null,null,null,null,0]
[null,"Passengers Transported",null,0,0,0,30,30]
[null,"Cargo Transported (lbs.)",null,0,0,0,1969,1969]
[null,"Water Dropped (gal.)",null,null,null,null,0,0]
[null,"Initial Attacks",null,null,null,null,0,0]
[null,"SARs, Projects, Training & Fires Supported",null,0,0,0,3]
[]
[null,"Totals by unit","Total All Units","MORA","NOCA","NOCA","OLYM","USFS / OWF"]
[null,"Days at each NPS or USFS Unit",{"$f":"SUM(D106:H106)","v":{"$error":"#REF!"}},{"$f":"#REF!","v":{"$error":"#REF!"}},{"$f":"#REF!","v":{"$error":"#REF!"}},{"$f":"#REF!","v":{"$error":"#REF!"}},{"$f":"#REF!","v":{"$error":"#REF!"}},{"$f":"#REF!","v":{"$error":"#REF!"}}]
[null,"SARs involving short-haul at each Unit",{"$f":"SUM(D107:H107)","v":11},5,2,2,1,1]
[]
[]
[null,"Other NPS","120-day Contract TOTALS"]
[null,null,null,"SAR","Project","Training","Fire","Total"]
[null,"Total Cost",null,{"$f":"SUM(#REF!,#REF!,#REF!,#REF!,#REF!,#REF!,#REF!)","v":{"$error":"#REF!"}},{"$f":"SUM(#REF!,#REF!,#REF!,#REF!,#REF!,#REF!,#REF!)","v":{"$error":"#REF!"}},{"$f":"SUM(#REF!,#REF!,#REF!,#REF!,#REF!,#REF!,#REF!)","v":{"$error":"#REF!"}},{"$f":"SUM(#REF!,#REF!,#REF!,#REF!,#REF!,#REF!,#REF!)","v":{"$error":"#REF!"}},{"$f":"SUM(#REF!,#REF!,#REF!,#REF!,#REF!,#REF!,#REF!)","v":{"$error":"#REF!"}}]
[null,"Flight Time Hours",null,{"$f":"SUM(#REF!,#REF!,#REF!,#REF!,#REF!,#REF!,#REF!)","v":{"$error":"#REF!"}},{"$f":"SUM(#REF!,#REF!,#REF!,#REF!,#REF!,#REF!,#REF!)","v":{"$error":"#REF!"}},{"$f":"SUM(#REF!,#REF!,#REF!,#REF!,#REF!,#REF!,#REF!)","v":{"$error":"#REF!"}},{"$f":"SUM(#REF!,#REF!,#REF!,#REF!,#REF!,#REF!,#REF!)","v":{"$error":"#REF!"}},{"$f":"SUM(D113:G113)","v":{"$error":"#REF!"}}]
[null,"Flight Time Percentage",null,{"$f":"IF(SUM(D113:G113)=0,0,D113/SUM(D113:G113))","v":{"$error":"#REF!"}},{"$f":"IF(SUM(D113:G113)=0,0,E113/SUM(D113:G113))","v":{"$error":"#REF!"}},{"$f":"IF(SUM(D113:G113)=0,0,F113/SUM(D113:G113))","v":{"$error":"#REF!"}},{"$f":"IF(SUM(D113:G113)=0,0,G113/SUM(D113:G113))","v":{"$error":"#REF!"}},{"$f":"SUM(D114:G114)","v":{"$error":"#REF!"}}]
[null,"Flight Time Cost",null,{"$f":"SUM(#REF!,#REF!,#REF!,#REF!,#REF!,#REF!,#REF!)","v":{"$error":"#REF!"}},{"$f":"SUM(#REF!,#REF!,#REF!,#REF!,#REF!,#REF!,#REF!)","v":{"$error":"#REF!"}},{"$f":"SUM(#REF!,#REF!,#REF!,#REF!,#REF!,#REF!,#REF!)","v":{"$error":"#REF!"}},{"$f":"SUM(#REF!,#REF!,#REF!,#REF!,#REF!,#REF!,#REF!)","v":{"$error":"#REF!"}},{"$f":"SUM(D115:G115)","v":{"$error":"#REF!"}}]
[null,"Extended Standby Cost",null,{"$f":"SUM(#REF!,#REF!,#REF!,#REF!,#REF!,#REF!,#REF!)","v":{"$error":"#REF!"}},{"$f":"SUM(#REF!,#REF!,#REF!,#REF!,#REF!,#REF!,#REF!)","v":{"$error":"#REF!"}},{"$f":"SUM(#REF!,#REF!,#REF!,#REF!,#REF!,#REF!,#REF!)","v":{"$error":"#REF!"}},{"$f":"SUM(#REF!,#REF!,#REF!,#REF!,#REF!,#REF!,#REF!)","v":{"$error":"#REF!"}},{"$error":"#REF!"}]
[null,"Per Diem Cost",null,{"$f":"SUM(#REF!,#REF!,#REF!,#REF!,#REF!,#REF!,#REF!)","v":{"$error":"#REF!"}},{"$f":"SUM(#REF!,#REF!,#REF!,#REF!,#REF!,#REF!,#REF!)","v":{"$error":"#REF!"}},{"$f":"SUM(#REF!,#REF!,#REF!,#REF!,#REF!,#REF!,#REF!)","v":{"$error":"#REF!"}},{"$f":"SUM(#REF!,#REF!,#REF!,#REF!,#REF!,#REF!,#REF!)","v":{"$error":"#REF!"}},{"$error":"#REF!"}]
[null,"Service Truck Mileage Cost",null,{"$f":"SUM(#REF!,#REF!,#REF!,#REF!,#REF!,#REF!,#REF!)","v":{"$error":"#REF!"}},{"$f":"SUM(#REF!,#REF!,#REF!,#REF!,#REF!,#REF!,#REF!)","v":{"$error":"#REF!"}},{"$f":"SUM(#REF!,#REF!,#REF!,#REF!,#REF!,#REF!,#REF!)","v":{"$error":"#REF!"}},{"$f":"SUM(#REF!,#REF!,#REF!,#REF!,#REF!,#REF!,#REF!)","v":{"$error":"#REF!"}},{"$error":"#REF!"}]
[null,"Relief Travel Cost & Other Special Charges",null,null,null,null,null,{"$f":"SUM(D119:G119)","v":0}]
[null,"Passengers transported",null,{"$f":"SUM(#REF!,#REF!,#REF!,#REF!,#REF!,#REF!,#REF!)","v":{"$error":"#REF!"}},{"$f":"SUM(#REF!,#REF!,#REF!,#REF!,#REF!,#REF!,#REF!)","v":{"$error":"#REF!"}},{"$f":"SUM(#REF!,#REF!,#REF!,#REF!,#REF!,#REF!,#REF!)","v":{"$error":"#REF!"}},{"$f":"SUM(#REF!,#REF!,#REF!,#REF!,#REF!,#REF!,#REF!)","v":{"$error":"#REF!"}},{"$error":"#REF!"}]
[null,"Cargo transported (lbs.)",null,{"$f":"SUM(#REF!,#REF!,#REF!,#REF!,#REF!,#REF!,#REF!)","v":{"$error":"#REF!"}},{"$f":"SUM(#REF!,#REF!,#REF!,#REF!,#REF!,#REF!,#REF!)","v":{"$error":"#REF!"}},{"$f":"SUM(#REF!,#REF!,#REF!,#REF!,#REF!,#REF!,#REF!)","v":{"$error":"#REF!"}},{"$f":"SUM(#REF!,#REF!,#REF!,#REF!,#REF!,#REF!,#REF!)","v":{"$error":"#REF!"}},{"$error":"#REF!"}]
[null,"Water dropped (gal.)",null,null,null,null,{"$f":"SUM(#REF!,#REF!,#REF!,#REF!,#REF!,#REF!,#REF!)","v":{"$error":"#REF!"}},{"$error":"#REF!"}]
[null,"Initial Attacks",null,null,null,null,{"$f":"SUM(#REF!,#REF!,#REF!,#REF!,#REF!,#REF!,#REF!)","v":{"$error":"#REF!"}},{"$error":"#REF!"}]
[null,"SARs, Projects & Fires supported",null,{"$f":"SUM(#REF!,#REF!,#REF!,#REF!,#REF!,#REF!,#REF!)","v":{"$error":"#REF!"}},{"$f":"SUM(#REF!,#REF!,#REF!,#REF!,#REF!,#REF!,#REF!)","v":{"$error":"#REF!"}},{"$f":"SUM(#REF!,#REF!,#REF!,#REF!,#REF!,#REF!,#REF!)","v":{"$error":"#REF!"}},{"$f":"SUM(#REF!,#REF!,#REF!,#REF!,#REF!,#REF!,#REF!)","v":{"$error":"#REF!"}}]
[]
[null,"Totals by unit","Total All Units","MORA","NOCA","NOCA","OLYM","USFS / OWF"]
[null,"Days at each NPS or USFS Unit",{"$f":"SUM(D127:H127)","v":{"$error":"#REF!"}},{"$f":"#REF!","v":{"$error":"#REF!"}},{"$f":"#REF!","v":{"$error":"#REF!"}},{"$f":"#REF!","v":{"$error":"#REF!"}},{"$f":"#REF!","v":{"$error":"#REF!"}},{"$f":"#REF!","v":{"$error":"#REF!"}}]
[null,"SARs involving short-haul at each Unit"]
[]
[null,"Unit Statistics","NPS or USFS Unit"]
[null,null,"MORA","NOCA","OLYM","USFS/BIA","Other NPS","Total"]
[null,"Total Cost",70759.649999999281,104477.45000000084,22280,12554.099999999897,0,210071.2]
[null,"Flight Time Hours",60.699999999999363,68.200000000000728,19,11.099999999999909,0,159]
[null,"Flight Time Percentage",0.38176100628930415,0.42893081761006746,0.11949685534591195,6.9811320754716411E-2,0,1]

{"sheet":"1-May-23 sample day","index":4,"n_rows":177,"n_cols":100,"rows_kept":177,"cut":false,"hidden":false,"merged":[[106,16,106,35],[106,36,106,39],[99,37,99,39],[100,16,100,17],[100,18,100,21],[100,22,100,23],[100,24,100,25],[100,26,100,28],[100,29,100,31],[100,32,100,33],[100,34,100,36],[100,37,100,39],[99,16,99,17],[99,18,99,21],[99,22,99,23],[99,24,99,25],[99,26,99,28],[99,29,99,31],[99,32,99,33],[99,34,99,36],[101,21,101,35],[101,36,101,39],[97,34,97,36],[97,37,97,39],[98,16,98,17],[98,18,98,21],[98,22,98,23],[98,24,98,25],[98,26,98,28],[98,29,98,31],[98,32,98,33],[97,16,97,17],[97,18,97,21],[97,22,97,23],[97,24,97,25],[97,26,97,28],[97,29,97,31],[98,34,98,36],[98,37,98,39],[97,32,97,33],[95,34,95,36],[95,37,95,39],[96,16,96,21],[96,22,96,23],[96,24,96,25],[96,26,96,28],[96,29,96,31],[96,32,96,33],[96,34,96,36],[96,37,96,39],[95,16,95,21],[95,22,95,23],[95,24,95,25],[95,26,95,28],[95,29,95,31],[95,32,95,33],[93,34,93,36],[93,37,93,39],[94,16,94,21],[94,22,94,23],[94,24,94,25],[94,26,94,28],[94,29,94,31],[94,32,94,33],[94,34,94,36],[94,37,94,39],[93,16,93,21],[93,22,93,23],[93,24,93,25],[93,26,93,28],[93,29,93,31],[93,32,93,33],[89,24,89,25],[89,26,89,28],[89,29,89,31],[89,32,89,33],[91,34,91,36],[91,37,91,39],[92,16,92,21],[92,22,92,23],[92,24,92,25],[92,26,92,28],[92,29,92,31],[92,32,92,33],[92,34,92,36],[92,37,92,39],[91,16,91,21],[91,22,91,23],[91,24,91,25],[91,26,91,28],[91,29,91,31],[91,32,91,33],[83,53,83,55],[85,22,86,35],[86,16,86,17],[86,18,86,20],[87,16,87,17],[87,18,87,20],[87,22,87,23],[87,24,87,25],[87,26,88,28],[87,29,88,31],[87,34,87,36],[87,37,87,39],[87,45,100,56],[88,16,88,17],[88,18,88,20],[88,22,88,23],[88,24,88,25],[88,32,88,33],[88,34,88,36],[88,37,88,39],[89,34,89,36],[89,37,89,39],[90,16,90,21],[90,22,90,23],[82,44,82,45],[82,46,82,47],[82,48,82,49],[82,50,82,51],[83,2,106,11],[83,21,83,35],[83,36,83,39],[83,45,83,47],[83,51,83,52],[87,32,87,33],[82,21,82,32],[82,33,82,35],[82,36,82,37],[82,38,82,39],[82,40,82,41],[82,42,82,43],[90,24,90,25],[90,26,90,28],[90,29,90,31],[90,32,90,33],[90,34,90,36],[90,37,90,39],[89,16,89,21],[89,22,89,23],[81,42,81,43],[81,44,81,45],[81,46,81,47],[81,48,81,49],[81,50,81,51],[81,28,81,29],[81,30,81,31],[81,32,81,33],[81,34,81,35],[81,36,81,37],[81,38,81,39],[80,50,80,51],[81,1,81,2],[81,3,81,4],[81,5,81,11],[81,16,81,17],[81,18,81,21],[81,22,81,23],[81,24,81,25],[81,26,81,27],[80,36,80,37],[80,38,80,39],[80,40,80,41],[80,42,80,43],[80,44,80,45],[80,46,80,47],[80,24,80,25],[80,26,80,27],[80,28,80,29],[80,30,80,31],[80,32,80,33],[80,34,80,35],[80,1,80,2],[80,3,80,4],[81,40,81,41],[80,5,80,11],[80,16,80,17],[80,18,80,21],[80,22,80,23],[79,40,79,41],[79,42,79,43],[79,44,79,45],[79,46,79,47],[79,48,79,49],[80,48,80,49],[79,50,79,51],[79,28,79,29],[79,30,79,31],[79,32,79,33],[79,34,79,35],[79,36,79,37],[79,38,79,39],[78,48,78,49],[78,50,78,51],[78,38,78,39],[78,40,78,41],[78,42,78,43],[78,44,78,45],[78,46,78,47],[79,1,79,2],[79,3,79,4],[79,5,79,11],[79,16,79,17],[79,18,79,21],[79,22,79,23],[79,24,79,25],[79,26,79,27],[78,36,78,37],[78,24,78,25],[78,26,78,27],[78,28,78,29],[78,30,78,31],[78,32,78,33],[78,34,78,35],[78,1,78,2],[78,3,78,4],[78,5,78,11],[78,16,78,17],[78,18,78,21],[78,22,78,23],[77,42,77,43],[77,44,77,45],[77,46,77,47],[77,48,77,49],[77,50,77,51],[77,28,77,29],[77,30,77,31],[77,32,77,33],[77,34,77,35],[77,36,77,37],[77,38,77,39],[76,50,76,51],[77,1,77,2],[77,3,77,4],[77,5,77,11],[77,16,77,17],[77,18,77,21],[77,22,77,23],[77,24,77,25],[77,26,77,27],[76,36,76,37],[76,38,76,39],[76,40,76,41],[76,42,76,43],[76,44,76,45],[76,46,76,47],[76,24,76,25],[76,26,76,27],[76,28,76,29],[76,30,76,31],[76,32,76,33],[76,34,76,35],[76,1,76,2],[76,3,76,4],[77,40,77,41],[76,5,76,11],[76,16,76,17],[76,18,76,21],[76,22,76,23],[75,40,75,41],[75,42,75,43],[75,44,75,45],[75,46,75,47],[75,48,75,49],[76,48,76,49],[75,50,75,51],[75,28,75,29],[75,30,75,31],[75,32,75,33],[75,34,75,35],[75,36,75,37],[75,38,75,39],[74,42,74,43],[74,44,74,45],[74,46,74,47],[74,48,74,49],[74,50,74,51],[75,1,75,2],[75,3,75,4],[75,5,75,11],[75,16,75,17],[75,18,75,21],[75,22,75,23],[75,24,75,25],[75,26,75,27],[74,40,74,41],[74,28,74,29],[74,30,74,31],[74,32,74,33],[74,34,74,35],[74,36,74,37],[74,38,74,39],[74,1,74,2],[74,3,74,4],[74,5,74,11],[74,16,74,17],[74,18,74,21],[74,22,74,23],[74,24,74,25],[74,26,74,27],[73,24,73,25],[73,26,73,27],[73,28,73,29],[73,30,73,31],[73,32,73,33],[73,34,73,35],[73,1,73,2],[73,3,73,4],[73,5,73,11],[73,16,73,17],[73,18,73,21],[73,22,73,23],[72,34,72,35],[72,36,72,37],[72,38,72,39],[73,48,73,49],[73,50,73,51],[73,38,73,39],[73,40,73,41],[73,42,73,43],[73,44,73,45],[73,46,73,47],[73,36,73,37],[72,99,73,99],[72,71,73,73],[72,74,73,80],[72,81,73,81],[72,82,73,82],[72,83,73,83],[72,84,73,84],[72,40,72,41],[72,42,72,43],[72,44,72,45],[72,46,72,47],[72,48,72,49],[72,50,72,51],[72,86,73,88],[72,89,73,95],[72,96,73,96],[72,97,73,97],[72,98,73,98],[72,1,72,2],[72,3,72,4],[72,5,72,11],[72,16,72,17],[72,18,72,21],[72,22,72,23],[72,24,72,25],[72,26,72,27],[71,36,71,37],[71,24,71,25],[71,26,71,27],[71,28,71,29],[71,30,71,31],[71,32,71,33],[71,34,71,35],[71,1,71,2],[71,3,71,4],[71,5,71,11],[71,16,71,17],[71,18,71,21],[71,22,71,23],[72,28,72,29],[72,30,72,31],[72,32,72,33],[70,96,71,99],[68,18,68,26],[68,30,68,33],[68,41,68,47],[68,53,68,56],[70,22,70,23],[70,24,70,35],[70,36,70,47],[70,48,70,52],[70,53,70,56],[70,71,71,73],[70,74,71,80],[70,81,71,84],[70,86,71,88],[70,89,71,95],[71,48,71,49],[71,50,71,51],[71,38,71,39],[71,40,71,41],[71,42,71,43],[71,44,71,45],[71,46,71,47],[59,15,59,18],[58,36,59,43],[58,44,59,50],[58,55,59,57],[58,58,59,64],[65,96,66,99],[67,71,69,71],[67,72,69,80],[67,81,69,84],[67,86,69,86],[67,87,69,95],[67,96,69,99],[65,18,66,41],[65,71,66,71],[65,72,66,80],[65,81,66,84],[65,86,66,86],[65,87,66,95],[58,66,59,69],[60,0,63,19],[60,51,63,70],[61,71,62,71],[61,72,62,80],[61,81,62,84],[61,86,62,86],[61,87,62,95],[61,96,62,99],[63,71,64,71],[63,72,64,80],[63,81,64,84],[63,86,64,86],[63,87,64,95],[63,96,64,99],[54,96,56,99],[59,81,60,84],[59,86,60,86],[59,87,60,90],[59,91,60,95],[59,96,60,99],[54,78,56,80],[54,81,56,84],[54,86,56,86],[54,76,56,77],[57,96,58,99],[58,5,58,6],[58,7,58,8],[58,52,59,53],[59,71,60,71],[59,72,60,75],[59,76,60,80],[57,78,58,80],[57,81,58,84],[57,86,58,86],[57,87,58,90],[57,91,58,92],[57,93,58,95],[56,67,57,69],[57,5,57,6],[57,7,57,8],[57,71,58,71],[57,72,58,75],[57,76,58,77],[56,7,56,8],[56,21,57,29],[54,91,56,92],[54,93,56,95],[53,30,53,39],[53,40,53,49],[54,5,54,6],[54,7,54,8],[51,87,53,90],[56,30,57,39],[56,40,57,49],[56,52,57,57],[56,58,57,66],[54,87,56,90],[54,21,54,29],[54,30,54,39],[54,40,54,49],[55,21,55,29],[55,30,55,39],[55,40,55,49],[55,5,55,6],[55,7,55,8],[55,52,55,57],[55,58,55,66],[55,67,55,69],[56,5,56,6],[54,71,56,71],[54,72,56,75],[51,91,53,92],[51,93,53,95],[51,96,53,99],[52,5,52,6],[52,7,52,8],[52,21,52,29],[52,30,52,39],[52,40,52,49],[52,52,54,69],[51,71,53,71],[51,72,53,75],[51,76,53,77],[51,78,53,80],[51,81,53,84],[51,86,53,86],[51,5,51,6],[51,7,51,8],[51,21,51,29],[51,30,51,39],[51,40,51,49],[51,52,51,69],[53,5,53,6],[53,7,53,8],[53,21,53,29],[48,5,48,6],[48,7,48,8],[48,71,50,71],[48,72,50,75],[50,30,50,39],[50,40,50,49],[45,86,47,86],[48,93,50,95],[48,96,50,99],[49,5,49,6],[49,7,49,8],[49,21,49,29],[49,30,49,39],[49,40,49,49],[50,5,50,6],[50,7,50,8],[50,21,50,29],[48,76,50,77],[48,78,50,80],[48,81,50,84],[48,86,50,86],[48,87,50,90],[48,91,50,92],[45,5,45,6],[45,7,45,8],[45,21,45,29],[45,30,45,39],[45,87,47,90],[45,91,47,92],[45,93,47,95],[45,96,47,99],[46,5,46,6],[46,7,46,8],[46,21,47,29],[46,30,47,39],[46,40,47,49],[45,40,45,49],[45,71,47,71],[45,72,47,75],[45,76,47,77],[45,78,47,80],[45,81,47,84],[47,5,47,6],[47,7,47,8],[42,93,44,95],[42,96,44,99],[42,38,43,43],[42,44,43,49],[42,71,44,71],[42,72,44,75],[42,76,44,77],[42,78,44,80],[43,5,43,6],[43,7,43,8],[44,5,44,6],[44,7,44,8],[44,32,44,38],[42,5,42,6],[42,7,42,8],[42,21,43,25],[42,26,43,31],[42,32,43,37],[42,81,44,84],[42,86,44,86],[42,87,44,90],[42,91,44,92],[36,72,38,75],[36,76,38,77],[36,78,38,80],[39,93,41,95],[39,96,41,99],[39,5,39,6],[39,7,39,8],[39,71,41,71],[39,72,41,75],[39,76,41,77],[39,78,41,80],[40,5,40,6],[40,7,40,8],[40,21,41,25],[40,26,41,31],[40,32,41,37],[40,38,41,43],[40,44,41,49],[41,5,41,6],[41,7,41,8],[35,5,35,6],[35,7,35,8],[35,21,36,24],[35,25,36,29],[35,30,36,32],[35,33,36,37],[36,5,36,6],[36,7,36,8],[33,81,35,84],[33,5,33,6],[33,7,33,8],[33,21,34,24],[33,25,34,29],[33,30,34,32],[33,33,34,37],[34,5,34,6],[34,7,34,8],[36,81,38,84],[37,5,37,6],[37,7,37,8],[37,34,38,43],[37,44,38,49],[38,5,38,6],[38,7,38,8],[33,86,35,86],[33,87,35,90],[33,91,35,92],[33,93,35,95],[33,96,35,99],[33,38,34,43],[33,44,34,49],[33,71,35,71],[33,72,35,75],[33,76,35,77],[33,78,35,80],[35,38,36,43],[35,44,36,49],[36,52,50,69],[36,71,38,71],[36,91,38,92],[36,93,38,95],[36,96,38,99],[36,86,38,86],[36,87,38,90],[39,81,41,84],[39,86,41,86],[39,87,41,90],[39,91,41,92],[32,5,32,6],[32,7,32,8],[32,76,32,77],[32,78,32,80],[32,81,32,84],[32,91,32,92],[31,38,32,43],[31,44,32,49],[31,76,31,80],[31,81,31,84],[31,91,31,95],[31,96,31,99],[32,93,32,95],[32,96,32,99],[29,44,30,49],[30,5,30,6],[30,7,30,8],[30,52,34,69],[31,5,31,6],[31,7,31,8],[31,21,32,24],[31,25,32,29],[31,30,32,32],[31,33,32,37],[29,5,29,6],[29,7,29,8],[29,21,30,29],[29,30,30,32],[29,33,30,37],[29,38,30,43],[28,71,30,71],[28,72,30,77],[28,78,30,84],[28,86,30,86],[28,87,30,92],[28,93,30,99],[27,58,28,58],[27,59,28,64],[27,65,28,67],[27,68,28,69],[28,5,28,6],[28,7,28,8],[27,38,28,43],[27,44,28,49],[27,52,28,54],[27,55,28,55],[27,56,28,56],[27,57,28,57],[25,91,27,91],[25,92,27,92],[25,93,27,99],[26,5,26,6],[26,7,26,8],[27,5,27,6],[27,7,27,8],[27,21,28,29],[27,30,28,32],[27,33,28,37],[25,77,27,77],[25,78,27,84],[25,86,27,86],[25,87,27,88],[25,89,27,89],[25,90,27,90],[25,68,26,69],[25,71,27,71],[25,72,27,73],[25,74,27,74],[25,75,27,75],[25,76,27,76],[25,55,26,55],[25,56,26,56],[25,57,26,57],[25,58,26,58],[25,59,26,64],[25,65,26,67],[23,68,24,69],[24,1,24,18],[25,5,25,6],[25,7,25,8],[25,21,26,29],[25,30,26,32],[25,33,26,37],[25,38,26,43],[25,44,26,49],[25,52,26,54],[23,55,24,55],[23,56,24,56],[23,57,24,57],[23,58,24,58],[23,59,24,64],[23,65,24,67],[23,21,24,29],[23,30,24,32],[23,33,24,37],[23,38,24,43],[23,44,24,49],[23,52,24,54],[22,71,24,71],[22,72,24,77],[22,78,24,84],[22,86,24,86],[22,87,24,92],[22,93,24,99],[21,58,22,58],[21,59,22,64],[21,65,22,67],[21,68,22,69],[22,5,22,6],[22,7,22,8],[21,38,22,43],[21,44,22,49],[21,52,22,54],[21,55,22,55],[21,56,22,56],[21,57,22,57],[19,93,21,99],[19,68,20,69],[19,71,21,71],[19,72,21,77],[19,78,21,84],[19,86,21,86],[19,87,21,92],[19,55,20,55],[19,56,20,56],[19,57,20,57],[19,58,20,58],[20,2,20,3],[20,5,20,6],[20,7,20,8],[20,13,20,14],[21,5,21,6],[21,7,21,8],[21,21,22,29],[21,30,22,32],[21,33,22,37],[19,59,20,64],[19,65,20,67],[19,21,20,29],[19,30,20,32],[19,33,20,37],[19,38,20,43],[19,44,20,49],[19,52,20,54],[18,5,18,6],[18,7,18,8],[18,13,18,14],[19,5,19,6],[19,7,19,8],[19,13,19,14],[17,56,18,56],[17,57,18,57],[17,58,18,58],[17,59,18,64],[17,65,18,67],[17,44,18,49],[17,52,18,54],[17,55,18,55],[17,68,18,69],[16,93,18,93],[16,94,18,95],[16,96,18,96],[16,97,18,98],[16,99,18,99],[17,5,17,6],[17,7,17,8],[17,21,18,29],[17,30,18,32],[17,33,18,37],[16,81,18,81],[16,82,18,83],[16,84,18,84],[16,86,18,86],[16,87,18,88],[16,89,18,92],[16,17,17,17],[16,71,18,71],[16,72,18,73],[16,74,18,77],[16,78,18,78],[16,79,18,80],[17,38,18,43],[15,2,15,3],[15,21,16,29],[15,30,16,32],[15,33,16,37],[15,38,16,43],[15,44,16,49],[16,5,16,11],[16,13,17,14],[16,15,17,15],[16,16,17,16],[13,89,15,92],[13,93,15,93],[13,94,15,95],[13,96,15,96],[13,97,15,98],[13,99,15,99],[13,79,15,80],[13,81,15,81],[13,82,15,83],[13,84,15,84],[13,86,15,86],[13,87,15,88],[13,60,13,69],[13,71,15,71],[13,72,15,73],[13,74,15,77],[13,78,15,78],[14,59,14,64],[14,65,14,69],[15,52,16,54],[15,55,16,55],[15,56,16,56],[15,57,16,57],[15,58,16,58],[15,59,16,64],[15,65,16,67],[15,68,16,69],[10,2,10,3],[10,5,10,7],[10,9,10,13],[10,21,10,22],[10,28,10,30],[10,32,10,37],[10,86,12,87],[13,2,13,3],[13,5,13,13],[13,30,14,32],[13,33,14,37],[13,38,14,43],[13,44,14,49],[14,2,14,3],[14,5,14,13],[11,2,11,3],[11,5,11,7],[11,9,11,13],[12,2,12,3],[12,5,12,7],[12,9,12,13],[12,21,12,33],[12,34,12,37],[13,53,13,58],[10,88,12,92],[10,93,12,94],[10,95,12,99],[10,39,10,43],[10,44,10,49],[10,52,10,58],[10,59,10,69],[10,71,12,72],[10,73,12,77],[12,52,12,58],[12,59,12,69],[11,53,11,58],[11,60,11,69],[10,78,12,79],[10,80,12,84],[7,95,9,99],[8,5,8,8],[8,9,8,13],[8,21,8,22],[8,23,8,25],[8,27,8,31],[8,32,8,37],[8,38,8,43],[8,44,8,49],[8,52,8,54],[7,73,9,77],[7,78,9,79],[7,80,9,84],[7,86,9,87],[7,88,9,92],[7,93,9,94],[6,21,6,24],[6,25,6,29],[6,30,6,33],[7,1,7,3],[7,5,7,7],[7,9,7,13],[7,52,7,54],[7,55,7,58],[7,71,9,72],[8,59,8,60],[8,63,8,64],[8,66,8,67],[9,2,9,3],[9,5,9,7],[9,9,9,13],[9,53,9,58],[9,59,9,61],[9,63,9,64],[9,66,9,67],[102,45,102,55],[103,45,103,55],[104,45,104,55],[105,45,105,55],[106,45,106,55],[0,0,0,19],[0,20,0,50],[0,51,0,70],[4,93,6,94],[5,1,5,2],[5,3,5,6],[5,13,5,17],[5,52,5,54],[5,55,5,58],[5,59,5,63],[5,64,5,69],[6,16,6,17],[4,52,4,53],[4,54,4,56],[4,65,4,66],[4,67,4,69],[4,78,6,79],[4,80,6,84],[6,52,6,54],[0,71,0,99],[1,4,2,14],[1,20,2,50],[1,52,2,54],[1,55,2,65],[1,71,6,77],[1,78,3,79],[6,59,6,64],[6,65,6,69],[1,80,3,84],[1,86,6,92],[1,93,3,94],[1,95,3,99],[3,1,3,18],[4,1,4,2],[4,3,4,8],[6,34,6,40],[6,41,6,44],[6,45,6,49],[4,95,6,99],[6,55,6,58],[4,13,4,14],[4,44,4,45],[4,46,4,49]]}
[{"$f":"'Contract Info'!A1:G1","v":"SuperManager v3.23 SEKI"},null,null,null,null,null,null,null,null,null,null,null,null,null,null,null,null,null,null,null,null,null,null,null,null,null,null,null,null,null,null,null,null,null,null,null,null,null,null,null,null,null,null,null,null,null,null,null,null,null,null,{"$f":"A1","v":"SuperManager v3.23 SEKI"},null,null,null,null,null,null,null,null,null,null,null,null,null,null,null,null,null,null,null,{"$f":"A1","v":"SuperManager v3.23 SEKI"}]
[null,null,null,null,"Aircraft Daily Detail",null,null,null,null,null,null,null,null,null,null,null,null,null,null,null,"HELICOPTER DAILY USE and COST SUMMARY",null,null,null,null,null,null,null,null,null,null,null,null,null,null,null,null,null,null,null,null,null,null,null,null,null,null,null,null,null,null,null,"OAS-137 ",null,null,"Aircraft Contract Daily Diary",null,null,null,null,null,null,null,null,null,null,null,null,null,null,null,"INTERAGENCY                          HELICOPTER LOAD CALCULATION       Electronic Version 1.0 (3/04)",null,null,null,null,null,null,"MODEL",null,{"$f":"'Contract Info'!D4","v":"Airbus H-125"},null,null,null,null,null,"INTERAGENCY                          HELICOPTER LOAD CALCULATION       Electronic Version 1.0 (3/04)",null,null,null,null,null,null,"MODEL",null,{"$f":"'Contract Info'!D4","v":"Airbus H-125"}]
[]
[]
[null,"Incident:",null,"SEKI Test #2",null,null,null,null,null,null,null,"Date:",null,"2023-05-01",null,null,null,null,null,null,null,"Activity Mission:",null,null,null,null,null,null," Fire",null,null,null,"SAR",null,null,null,"Project",null,null,null,"Training",null,null,null,"    Date:",null,{"$f":"N5","v":"2023-05-01"},null,null,null,null,null,"Contract #",null,{"$f":"'Contract Info'!D6","v":"140D8021D0666"},null,null,"Item:",{"$f":"'Contract Info'!F6","v":0},"Page",1,"OF",1,null,null,"DATE:",null,{"$f":"N5","v":"2023-05-01"},null,null,null,null,null,null,null,null,null,null,"N#",null,{"$f":"'Contract Info'!D3","v":"N836TJ"},null,null,null,null,null,null,null,null,null,null,null,null,"N#",null,{"$f":"'Contract Info'!D3","v":"N836TJ"}]
[null,"Contract #:",null,{"$f":"'Contract Info'!D6","v":"140D8021D0666"},null,null,null,{"$f":"('Contract Info'!F6)*(-1)","v":0},null,null,null,"Contractor:",null,{"$f":"'Contract Info'!$D$8","v":"Butterfly Airways, Inc."},null,null,null,null,null,null,null,null,null,null,null,null,null,null,null,null,null,null,null,null,null,null,null,null,null,null,null,null,null,null,null,null,null,null,null,null,null,null,"1. Contractor:",null,null,{"$f":"'Contract Info'!$D$8","v":"Butterfly Airways, Inc."},null,null,null,"7. Designated Base:",null,null,null,null,{"$f":"'Contract Info'!$D$7","v":"Asher Hill Helibase"}]
[null,null,null,null,null,null,null,null,null,null,null,null,null,null,null,null,"Unavailablty",null,null,null,null,"Helibase:",null,null,null,"Ash Mtn",null,null,null,null,"Incident:",null,null,null,{"$f":"D5","v":"SEKI Test #2"},null,null,null,null,null,null," Agency:",null,null,null,"NPS",null,null,null,null,null,null,"2. A/C Make/Model: ",null,null,{"$f":"'Contract Info'!$D$4","v":"Airbus H-125"},null,null,null,"8. Current Aircraft Location:",null,null,null,null,null,"AMH"]
[null,"Power Check",null,null,null," Resource",null,null,"Qty","Name",null,null,null,null,"Begin","End","Begin ","End",null,null,null,null,null,null,null,null,null,null,null,null,null,null,null,null,null,null,null,null,null,null,null,null,null,null,null,null,null,null,null,null,null,null,"    FAA #:",null,null,{"$f":"'Contract Info'!$D$3","v":"N836TJ"},null,null,null,null,null,null,null,null,null,null,null,null,null,null,null,"PILOT(S)",null,{"$f":"J10","v":"Frank Segovia"},null,null,null,null,"DATE",null,{"$f":"N5","v":"2023-05-01"},null,null,null,null,null,"PILOT(S)",null,{"$f":"BV8","v":"Frank Segovia"},null,null,null,null,"DATE",null,{"$f":"N5","v":"2023-05-01"}]
[null,"Engine#",1,2,null," Aircraft #:",null,null,null,{"$f":"'Contract Info'!$D$3","v":"N836TJ"},null,null,null,null,1200,1800,null,null,null,null,null,"N #:",null,{"$f":"'Contract Info'!$D$3","v":"N836TJ"},null,null,null,"Make/Model:",null,null,null,null,{"$f":"'Contract Info'!$D$4","v":"Airbus H-125"},null,null,null,null,null," Manager's Name:",null,null,null,null,null,"Tyler Maine",null,null,null,null,null,null,null,"3. Pilot(s) On Duty:",null,null,null,null,null,null,"9. Activity:",null,"ferry",null,"Training",null,null,"   Project"]
[null,"Hobbs",111,null,null," Pilot",null,null,1,"Frank Segovia",null,null,null,null,2100,2100,null,null,null,null,null,null,null,null,null,null,null,null,null,null,null,null,null,null,null,null,null,null,null,null,null,null,null,null,null,null,null,null,null,null,null,null,null,{"$f":"J10","v":"Frank Segovia"},null,null,null,null,null,"    Large Fire Support:",null,null,null,"IA",null,null,"SAR"]
[null,"Altitude",7000,null,null," Driver",null,null,null,null,null,null,null,null,null,null,null,null,null,null,null,"Type:",null,{"$f":"'Contract Info'!D5","v":3},null,null,null,null,"CWN",null,null,"X","Exclusive Use",null,null,null,null,null,null,"Other (specify):",null,null,null,null,null,null,null,null,null,null,null,null,"4. Mechanic(s) On Duty:",null,null,null,null,null,null,"10. Other Aircraft On Base",null,null,null,null,null,null,null,null,null,null,null,"MISSION",null,"IA/SAR Preparedness",null,null,null,null,"TIME",null,"0815",null,null,null,null,null,"MISSION",null,null,null,null,null,null,"TIME",null,""]
[null,"O.A.T.",30,null,null,"Mechanic",null,null,1,"Fernando Mechanda",null,null,null,null,1200,2359,null,null,null,null,null,null,null,null,null,null,null,null,null,null,null,null,null,null,null,null,null,null,null,null,null,null,null,null,null,null,null,null,null,null,null,null,null,{"$f":"J12","v":"Fernando Mechanda"},null,null,null,null,null,null,"none"]
[null,"NG",0.94,null,null,"Additionl",null,null,null,null,null,null,null,null,null,null,null,null,null,null,null,"Flight Invoice Reference Number(s):",null,null,null,null,null,null,null,null,null,null,null,null,null,null,null,null,null,null,null,null,null,null,null,null,null,null,null,null,null,null,"5. Driver(s) On Duty:",null,null,null,null,null,null,"11. Weather:"]
[null,"N2",391,null,null," Total Number of Vendor crewmembers",null,null,null,null,null,null,null,null,{"$f":"I10+I11+I12+I13","v":2},null,null,null,null,null,null,null,null,null,null,null,null,null,null,null,"Persons",null,null,"Quantity",null,null,null,null,"Rate",null,null,null,null,null,"Cost",null,null,null,null,null,null,null,null,{"$f":"J11","v":0},null,null,null,null,null,null,"Sunny and getting hotter!!",null,null,null,null,null,null,null,null,null,null,1,"DEPARTURE",null,"AMH",null,null,null,"PA",1650,null,"OAT",35,null,null,null,1,"DEPARTURE",null,null,null,null,null,"PA",null,null,"OAT"]
[null,"E.G.T.",840,null,null," Service Truck Mileage",null,null,null,null,null,null,null,null,20202,20222,null,null,null,null,null,null,null,null,null,null,null,null,null,null,null,null,null,null,null,null,null,null,null,null,null,null,null,null,null,null,null,null,null,null,null,null,"6. Total # Of Contractor Personnel:",null,null,null,null,null,{"$f":"O14","v":2},"12. Local Fuel Price",null,null,null,null,null,"N/A"]
[null,"T4",null,null,null,null,null,null,null,null,null,null,null,null,null,null,null,null,null,null,null,"Revenue Flight Hours:",null,null,null,null,null,null,null,null,null,null,null,{"$f":"J56","v":2.7000000000000028},null,null,null,null,1325,null,null,null,null,null,{"$f":"AH16*AM16","v":3577.5000000000036},null,null,null,null,null,null,null,"13. Pay Items",null,null,"Begin","End","Total","EXT.","14. SPECIAL EQUIPMENT & STATS",null,null,null,null,null,"HR/DAYS",null,null,"COST"]
[null,"Torque",0.92,null,null,"Allowable Loads:",null,null,null,null,null,null,null,"Delivered",null,"buckets or tanks","gal. per bkt/tank","total",null,null,null,null,null,null,null,null,null,null,null,null,null,null,null,null,null,null,null,null,null,null,null,null,null,null,null,null,null,null,null,null,null,null,null,null,null,null,null,null,null,null,null,null,null,null,null,null,null,null,null,null,null,2,"DESTINATION",null,"IA/SAR",null,null,null,"PA",7000,null,"OAT",25,null,null,null,2,"DESTINATION",null,null,null,null,null,"PA",null,null,"OAT"]
[null,"Perform",16.399999999999999,6.3,null,"PA (feet)",null,{"$f":"CB17","v":7000},null,{"$f":"CQ17","v":0},null,null,null,null,null,null,null,null,null,null,null,"*Availabiliy (Hours or Day)",null,null,null,null,null,null,null,null,null,null,null,1,null,null,null,null,3695,null,null,null,null,null,{"$f":"IF(AH18>1,(AH18*AM18/14),(AH18*AM18))","v":3695},null,null,null,null,null,null,null,"Availability",null,null,{"$f":"O9","v":1200},{"$f":"P9","v":1800},{"$f":"(BE18-BD18)/100","v":6},null,"Wilderness Flight Time",null,null,null,null,null,5]
[null,"Chart",0,{"$f":"C19","v":0},null,"ºC",null,{"$f":"CE17","v":25},null,{"$f":"CT17","v":0},null,null,null,"Water ",null,{"$f":"M56","v":1},180,{"$f":"Q19*P19","v":180}]
[null,"Margin",{"$f":"C18-C19","v":16.399999999999999},{"$f":"D18-D19","v":6.3},null,"# fuel",null,{"$f":"CA26","v":499.80000000000007},null,{"$f":"CP26","v":""},null,null,null,"Retardant",null,{"$f":"N56","v":1},null,{"$f":"Q20*P20","v":0},null,null,null,"Pilot Extended Standby",null,null,null,null,null,null,null,null,{"$f":"I10","v":1},null,null,{"$f":"IF(BF24<'Contract Info'!$D$23,\"0\",BF24-('Contract Info'!$D$23))","v":"0"},null,null,null,null,52,null,null,null,null,null,{"$f":"AH20*AE20*AM20","v":0},null,null,null,null,null,null,null,"Flight Time",null,null,{"$f":"F29","v":111},{"$f":"H56","v":113.7},{"$f":"J56","v":2.7000000000000028},null,"Wilderness Landings",null,null,null,null,null,4,null,null,null,null,null,3,"HELICOPTER EQUIPPED WEIGHT",null,null,null,null,null,3268,null,null,null,null,null,null,null,3,"HELICOPTER EQUIPPED WEIGHT"]
[null,"Next Due",{"$f":"C10+10","v":121},null,null,"HIGE",null,{"$f":"BY55","v":1277.1999999999998},null,{"$f":"CN55","v":""},null,null,null,"Foam",null,{"$f":"O56","v":1},null,{"$f":"Q21*P21","v":0}]
[null,null,null,null,null,"HOGE",null,{"$f":"CA55","v":1277.1999999999998},null,{"$f":"CP55","v":""},null,null,null,null,null,null,null,null,null,null,null,"Driver Extended Standby",null,null,null,null,null,null,null,null,{"$f":"I11","v":0},null,null,{"$f":"IF(BF26<'Contract Info'!$D$23,\"0\",BF26-('Contract Info'!$D$23))","v":"0"},null,null,null,null,39,null,null,null,null,null,{"$f":"AH22*AE22*AM22","v":0},null,null,null,null,null,null,null,"Service Miles",null,null,{"$f":"O15","v":20202},{"$f":"P15","v":20222},{"$f":"BE22-BD22","v":20},null,"Wilderness Ext. Load Deliveries or Pickups (non-s-h)",null,null,null,null,null,3]
[null,null,null,null,null,"HOGE-J",null,{"$f":"CD55","v":1452.1999999999998},null,{"$f":"CS55","v":""},null,null,null,null,null,null,null,null,null,null,null,null,null,null,null,null,null,null,null,null,null,null,null,null,null,null,null,null,null,null,null,null,null,null,null,null,null,null,null,null,null,null,null,null,null,null,null,null,null,null,null,null,null,null,null,null,null,null,null,null,null,4,"FLIGHT CREW WEIGHT",null,null,null,null,null,180,null,null,null,null,null,null,null,4,"FLIGHT CREW WEIGHT"]
[null,null,null,null,null,null,null,null,null,null,null,null,null,null,null,null,null,null,null,null,null,"Mechanic Extend Standby",null,null,null,null,null,null,null,null,{"$f":"I12","v":1},null,null,{"$f":"IF(BF28<'Contract Info'!$D$23,\"0\",BF28-('Contract Info'!$D$23))","v":2.59},null,null,null,null,59.59,null,null,null,null,null,{"$f":"AH24*AE24*AM24","v":154.3381},null,null,null,null,null,null,null,"Pilot Duty",null,null,{"$f":"O10","v":2100},{"$f":"P10","v":2100},{"$f":"(BE24-BD24)/100","v":0},{"$f":"IF(BF24<'Contract Info'!$D$23,0,BF24-('Contract Info'!$D$23))","v":0},"Wilderness Short-hauls",null,null,null,null,null,2]
[null,"Flight Log"]
[null,null,null,"Depart","Arrive",null,null,null,null,null,null,null," ",null,"Short-",null,null,"Flight","Non-",null,null,"Per Diem or RON",null,null,null,null,null,null,null,null,{"$f":"O14","v":2},null,null,null,null,null,null,null,169,null,null,null,null,null,{"$f":"AE26*AM26","v":338},null,null,null,null,null,null,null,"Driver Duty",null,null,{"$f":"O11","v":0},{"$f":"P11","v":0},{"$f":"(BE26-BD26)/100","v":0},{"$f":"IF(BF26<'Contract Info'!$D$23,0,BF26-('Contract Info'!$D$23))","v":0},"Initial Attacks",null,null,null,null,null,1,null,null,null,null,null,5,"FUEL WEIGHT",null,71.400000000000006,"gals   X",7,"lbs/gal",{"$f":"IF(BY26=\"\",\"\",SUM(BW26*BY26))","v":499.80000000000007},null,null,null,null,null,null,null,5,"FUEL WEIGHT",null,null,"gals   X",null,"lbs/gal",{"$f":"IF(CN26=\"\",\"\",SUM(CL26*CN26))","v":""}]
[null,"Depart","Destin","Clock","Clock","Depart",null,"Arrive",null,"Hobbs",null,"Lbs","H2O","Sling","Haul",null,"Use","Time","Revnue"]
[null,"From","To","Time","Time","Hobbs",null,"Hobbs",null,"Total","PAX","Cargo","Buckts","Loads","Evols","Acct","Code","Cost","flight?",null,null,"Service Truck Miles",null,null,null,null,null,null,null,null,null,null,null,{"$f":"P15-O15","v":20},null,null,null,null,2.4500000000000002,null,null,null,null,null,{"$f":"AH28*AM28","v":49},null,null,null,null,null,null,null,"Mechanic Duty",null,null,{"$f":"O12","v":1200},{"$f":"P12","v":2359},{"$f":"(BE28-BD28)/100","v":11.59},{"$f":"IF(BF28<'Contract Info'!$D$23,\"0\",BF28-('Contract Info'!$D$23))","v":2.59}]
[null,"ASH","KES",900,1005,111,null,112,null,{"$f":"IF(H29=\"\",\"\",IF(S29=\"\",H29-F29,\"\"))","v":1},2,320,null,null,null,"acct1",null,{"$f":"IF(J29=\"\",\"\",J29*('Contract Info'!$D$18))","v":1375},null,null,null,null,null,null,null,null,null,null,null,null,null,null,null,null,null,null,null,null,null,null,null,null,null,null,null,null,null,null,null,null,null,null,null,null,null,null,null,null,null,null,null,null,null,null,null,null,null,null,null,null,null,6,"OPERATING WEIGHT  (3 + 4 + 5)",null,null,null,null,null,{"$f":"IF(CA26=\"\",\"\",SUM(CA20:CG28))","v":3947.8},null,null,null,null,null,null,null,6,"OPERATING WEIGHT  (3 + 4 + 5)",null,null,null,null,null,{"$f":"IF(CP26=\"\",\"\",SUM(CP20:CV28))","v":""}]
[null,"KES","ASH",1200,1301,{"$f":"IF(H29=\"\",\"\",H29)","v":112},null,113,null,{"$f":"IF(H30=\"\",\"\",IF(S30=\"\",H30-F30,\"\"))","v":1},null,622,null,1,null,"acct2",null,{"$f":"IF(J30=\"\",\"\",J30*('Contract Info'!$D$18))","v":1375},null,null,null,"Addnl Crew Extend Stnby:",null,null,null,null,null,null,null,null,{"$f":"I13","v":0},null,null,null,null,null,null,null,10,null,null,null,null,null,{"$f":"AH30*AE30*AM30","v":0},null,null,null,null,null,null,null,"15. Aircraft Status: (Maintenance performed, power trend analysis completed, reasons for any unavailability, etc.)"]
[null,"ASH","ASH",1350,1409,{"$f":"IF(H30=\"\",\"\",H30)","v":113},null,113.3,null,{"$f":"IF(H31=\"\",\"\",IF(S31=\"\",H31-F31,\"\"))","v":0.29999999999999716},null,555,null,null,1,"acct3",null,{"$f":"IF(J31=\"\",\"\",J31*('Contract Info'!$D$18))","v":412.49999999999608},null,null,null,null,null,null,null,null,null,null,null,null,null,null,null,null,null,null,null,null,null,null,null,null,null,null,null,null,null,null,null,null,null,null,"Pre-flight maintenance performed. "]
[null,"ASH","FIR",1605,1634,{"$f":"IF(H31=\"\",\"\",H31)","v":113.3},null,113.7,null,0.40000000000000568,null,null,1,null,null,null,null,{"$f":"IF(J32=\"\",\"\",J32*('Contract Info'!$D$18))","v":550.00000000000784},null,null,null,"Add'l Cost:",null,null,null,null,null,null,null,null,null,null,null,null,null,null,null,null,null,null,null,null,null,null,{"$f":"AH32*AE32*AM32","v":0},null,null,null,null,null,null,null,null,null,null,null,null,null,null,null,null,null,null,null,null,null,null,null,null,null,null,null," ",null,null,null,"Non-Jettisonable",null,null,null,null,"Jettisonable",null,null,null,null,null," ",null,null,null,"Non-Jettisonable",null,null,null,null,"Jettisonable"]
[null,null,null,null,null,113.7,null,null,null,"",null,null,null,null,null,null,null,{"$f":"IF(J33=\"\",\"\",J33*('Contract Info'!$D$18))","v":""},null,null,null,null,null,null,null,null,null,null,null,null,null,null,null,null,null,null,null,null,null,null,null,null,null,null,null,null,null,null,null,null,null,null,null,null,null,null,null,null,null,null,null,null,null,null,null,null,null,null,null,null,null,null," ",null,null,null,"HIGE",null,"HOGE",null,null,"HOGE- J",null,null,null,null,null," ",null,null,null,"HIGE",null,"HOGE",null,null,"HOGE- J"]
[null,null,null,null,null,"",null,null,null,"",null,null,null,null,null,null,null,{"$f":"IF(J34=\"\",\"\",J34*('Contract Info'!$D$18))","v":""},null,null,null,"Add'l Cost:",null,null,null,null,null,null,null,null,null,null,null,null,null,null,null,null,null,null,null,null,null,null,{"$f":"AH34*AE34*AM34","v":0},null,null,null,null,null,null,null,null,null,null,null,null,null,null,null,null,null,null,null,null,null,null,null,null,null,null,"7a","PERFORMANCE REFERENCE    (List chart/supplement from Flight Manual)",null,null,null,"BLR Fig 1 or 2",null,"BLR Fig 1 or 2",null,null,"BLR Fig 1 or 2",null,null,null,null,"7a","PERFORMANCE REFERENCE    (List chart/supplement from Flight Manual)"]
[null,null,null,null,null,"",null,null,null,"",null,null,null,null,null,null,null,{"$f":"IF(J35=\"\",\"\",J35*('Contract Info'!$D$18))","v":""}]
[null,null,null,null,null,"",null,null,null,"",null,null,null,null,null,null,null,{"$f":"IF(J36=\"\",\"\",J36*('Contract Info'!$D$18))","v":""},null,null,null,"Add'l Cost:",null,null,null,null,null,null,null,null,null,null,null,null,null,null,null,null,null,null,null,null,null,null,{"$f":"AH36*AE36*AM36","v":0},null,null,null,null,null,null,null,"16. Narrative Report: (Include problems encountered, official visits or inspections, SAFECOMs submitted, etc.)"]
[null,null,null,null,null,"",null,null,null,"",null,null,null,null,null,null,null,{"$f":"IF(J37=\"\",\"\",J37*('Contract Info'!$D$18))","v":""},null,null,null,null,null,null,null,null,null,null,null,null,null,null,null,null,null,null,null,null,null,null,null,null,null,null,null,null,null,null,null,null,null,null,"Update helicopter and contract info on May 18th to be ready for the EU start date of May 19th.",null,null,null,null,null,null,null,null,null,null,null,null,null,null,null,null,null,null,"7b","COMPUTED GROSS WEIGHT  (From Flight Manual Performance Section)",null,null,null,5400,null,5400,null,null,5400,null,null,null,null,"7b","COMPUTED GROSS WEIGHT  (From Flight Manual Performance Section)"]
[null,null,null,null,null,"",null,null,null,"",null,null,null,null,null,null,null,{"$f":"IF(J38=\"\",\"\",J38*('Contract Info'!$D$18))","v":""},null,null,null,"* Do not calculate for exclusive  use contracts where",null,null,null,null,null,null,null,null,null,null,null,null,"Daily Grand Total Cost:",null,null,null,null,null,null,null,null,null,{"$f":"AS16+AS18+AS20+AS22+AS24+AS26+AS28+AS30+AS32+AS34+AS36","v":7813.8381000000036}]
[null,null,null,null,null,"",null,null,null,"",null,null,null,null,null,null,null,{"$f":"IF(J39=\"\",\"\",J39*('Contract Info'!$D$18))","v":""},null,null,null,null,"availability is paid from presuppression funds"]
[null,null,null,null,null,"",null,null,null,"",null,null,null,null,null,null,null,{"$f":"IF(J40=\"\",\"\",J40*('Contract Info'!$D$18))","v":""},null,null,null,null,null,null,null,null,null,null,null,null,null,null,null,null,null,null,null,null,null,null,null,null,null,null,null,null,null,null,null,null,null,null,null,null,null,null,null,null,null,null,null,null,null,null,null,null,null,null,null,null,null,8,"WEIGHT REDUCTION                (Required for all Non-Jettisonable loads)",null,null,null,175,null,175,null,null,0,null,null,null,null,8,"WEIGHT REDUCTION                (Required for all Non-Jettisonable loads)"]
[null,null,null,null,null,"",null,null,null,"",null,null,null,null,null,null,null,{"$f":"IF(J41=\"\",\"\",J41*('Contract Info'!$D$18))","v":""},null,null,null,"Total PAX Transported",null,null,null,null,"Total Pounds Cargo",null,null,null,null,null,"Total Gallons Water",null,null,null,null,null,"Sling Loads",null,null,null,null,null,"Short-haul Evolutions"]
[null,null,null,null,null,"",null,null,null,"",null,null,null,null,null,null,null,{"$f":"IF(J42=\"\",\"\",J42*('Contract Info'!$D$18))","v":""}]
[null,null,null,null,null,"",null,null,null,"",null,null,null,null,null,null,null,{"$f":"IF(J43=\"\",\"\",J43*('Contract Info'!$D$18))","v":""},null,null,null,{"$f":"K166","v":2},null,null,null,null,{"$f":"L166","v":1497},null,null,null,null,null,{"$f":"Q19*M166","v":180},null,null,null,null,null,{"$f":"N56","v":1},null,null,null,null,null,{"$f":"O56","v":1},null,null,null,null,null,null,null,null,null,null,null,null,null,null,null,null,null,null,null,null,null,null,null,null,null,null,9,"ADJUSTED WEIGHT                    (7b minus 8)",null,null,null,{"$f":"IF(BY37=\"\",\"\",SUM(BY37-BY40))","v":5225},null,{"$f":"IF(CA37=\"\",\"\",SUM(CA37-CA40))","v":5225},null,null,{"$f":"IF(CD37=\"\",\"\",SUM(CD37-CD40))","v":5400},null,null,null,null,9,"ADJUSTED WEIGHT                    (7b minus 8)",null,null,null,{"$f":"IF(CN37=\"\",\"\",SUM(CN37-CN40))","v":""},null,{"$f":"IF(CP37=\"\",\"\",SUM(CP37-CP40))","v":""},null,null,{"$f":"IF(CS37=\"\",\"\",SUM(CS37-CS40))","v":""}]
[null,null,null,null,null,"",null,null,null,"",null,null,null,null,null,null,null,{"$f":"IF(J44=\"\",\"\",J44*('Contract Info'!$D$18))","v":""}]
[null,null,null,null,null,"",null,null,null,"",null,null,null,null,null,null,null,{"$f":"IF(J45=\"\",\"\",J45*('Contract Info'!$D$18))","v":""},null,null,null,null,null,null,null,null,null,null,null,null,null,null,"Aerial Ignition"]
[null,null,null,null,null,"",null,null,null,"",null,null,null,null,null,null,null,{"$f":"IF(J46=\"\",\"\",J46*('Contract Info'!$D$18))","v":""},null,null,null,"Acres Treated",null,null,null,null,null,null,null,null,"PSD Spheres Used",null,null,null,null,null,null,null,null,null,"UAS Spheres Used",null,null,null,null,null,null,null,null,null,null,null,null,null,null,null,null,null,null,null,null,null,null,null,null,null,null,null,null,null,null,10,"GROSS WEIGHT LIMITATION    (From Flight Manual Limitations Section)",null,null,null,5225,null,5225,null,null,6173,null,null,null,null,10,"GROSS WEIGHT LIMITATION    (From Flight Manual Limitations Section)"]
[null,null,null,null,null,"",null,null,null,"",null,null,null,null,null,null,null,{"$f":"IF(J47=\"\",\"\",J47*('Contract Info'!$D$18))","v":""},null,null,null,0,null,null,null,null,null,null,null,null,"0",null,null,null,null,null,null,null,null,null,0]
[null,null,null,null,null,"",null,null,null,"",null,null,null,null,null,null,null,{"$f":"IF(J48=\"\",\"\",J48*('Contract Info'!$D$18))","v":""}]
[null,null,null,null,null,"",null,null,null,"",null,null,null,null,null,null,null,{"$f":"IF(J49=\"\",\"\",J49*('Contract Info'!$D$18))","v":""},null,null,null,null,null,null,null,null,null,null,null,null,null,null,null,null,null,null,null,null,null,null,null,null,null,null,null,null,null,null,null,null,null,null,null,null,null,null,null,null,null,null,null,null,null,null,null,null,null,null,null,null,null,11,"SELECTED WEIGHT                  (Lowest of 9 of 10)",null,null,null,{"$f":"IF(BY46=\"\",\"\",MIN(BY46,BY43))","v":5225},null,{"$f":"IF(CA46=\"\",\"\",MIN(CA46,CA43))","v":5225},null,null,{"$f":"IF(CD46=\"\",\"\",MIN(CD46,CD43))","v":5400},null,null,null,null,11,"SELECTED WEIGHT                  (Lowest of 9 of 10)",null,null,null,{"$f":"IF(CN46=\"\",\"\",MIN(CN46,CN43))","v":""},null,{"$f":"IF(CP46=\"\",\"\",MIN(CP46,CP43))","v":""},null,null,{"$f":"IF(CS46=\"\",\"\",MIN(CS46,CS43))","v":""}]
[null,null,null,null,null,"",null,null,null,"",null,null,null,null,null,null,null,{"$f":"IF(J50=\"\",\"\",J50*('Contract Info'!$D$18))","v":""},null,null,null,"Account Name",null,null,null,null,null,null,null,null,"Account Code",null,null,null,null,null,null,null,null,null,"Cost"]
[null,null,null,null,null,"",null,null,null,"",null,null,null,null,null,null,null,{"$f":"IF(J51=\"\",\"\",J51*('Contract Info'!$D$18))","v":""},null,null,null,"Daily Availability",null,null,null,null,null,null,null,null,"PF.FPAMD1022.00.1",null,null,null,null,null,null,null,null,null,{"$f":"SUM(AS18)","v":3695}]
[null,null,null,null,null,"",null,null,null,"",null,null,null,null,null,null,null,{"$f":"IF(J52=\"\",\"\",J52*('Contract Info'!$D$18))","v":""},null,null,null,null,null,null,null,null,null,null,null,null,null,null,null,null,null,null,null,null,null,null,null,null,null,null,null,null,null,null,null,null,null,null,"17. Miscellaneous Costs: (Contractor purchased permits, fees, travel, etc; to be reimbursed by Govt.)",null,null,null,null,null,null,null,null,null,null,null,null,null,null,null,null,null,null,12,"OPERATING WEIGHT                    (From Line 6)",null,null,null,{"$f":"IF(CA29=\"\",\"\",SUM(CA29))","v":3947.8},null,{"$f":"IF(CA29=\"\",\"\",SUM(CA29))","v":3947.8},null,null,{"$f":"IF(CA29=\"\",\"\",SUM(CA29))","v":3947.8},null,null,null,null,12,"OPERATING WEIGHT                    (From Line 6)",null,null,null,{"$f":"IF(CP29=\"\",\"\",SUM(CP29))","v":""},null,{"$f":"IF(CP29=\"\",\"\",SUM(CP29))","v":""},null,null,{"$f":"IF(CP29=\"\",\"\",SUM(CP29))","v":""}]
[null,null,null,null,null,"",null,null,null,"",null,null,null,null,null,null,null,{"$f":"IF(J53=\"\",\"\",J53*('Contract Info'!$D$18))","v":""}]
[null,null,null,null,null,"",null,null,null,"",null,null,null,null,null,null,null,{"$f":"IF(J54=\"\",\"\",J54*('Contract Info'!$D$18))","v":""}]
[null,null,null,null,null,"",null,null,null,"",null,null,null,null,null,null,null,{"$f":"IF(J55=\"\",\"\",J55*('Contract Info'!$D$18))","v":""},null,null,null,null,null,null,null,null,null,null,null,null,null,null,null,null,null,null,null,null,null,null,null,null,null,null,null,null,null,null,null,null,null,null,null,null,null,null,null,null,null,null,null,null,null,null,null,null,null,null,null,null,null,13,"ALLOWABLE PAYLOAD                  (11 minus 12)",null,null,null,{"$f":"IF(BY46=\"\",\"\",SUM(BY49-BY52))","v":1277.1999999999998},null,{"$f":"IF(CA46=\"\",\"\",SUM(CA49-CA52))","v":1277.1999999999998},null,null,{"$f":"IF(CD46=\"\",\"\",SUM(CD49-CD52))","v":1452.1999999999998},null,null,null,null,13,"ALLOWABLE PAYLOAD                  (11 minus 12)",null,null,null,{"$f":"IF(CN46=\"\",\"\",SUM(CN49-CN52))","v":""},null,{"$f":"IF(CP46=\"\",\"\",SUM(CP49-CP52))","v":""},null,null,{"$f":"IF(CS46=\"\",\"\",SUM(CS49-CS52))","v":""}]
[null,"TOTALS",null,null,null,{"$f":"F29","v":111},null,{"$f":"IF(H29=\"\",F29,LARGE(H29:H55,1))","v":113.7},null,{"$f":"SUM(J29:J55)","v":2.7000000000000028},2,1497,{"$f":"SUM(M29:M55)","v":1},1,1,null,null,{"$f":"SUM(R29:R55)","v":3712.5000000000036},null,null,null,null,null,null,null,null,null,null,null,null,null,null,null,null,null,null,null,null,null,null,null,null,null,null,null,null,null,null,null,null,null,null,"18. Govt. Representative Name/Title (Print):",null,null,null,null,null," Govt. Representative Signature:",null,null,null,null,null,null,null,null,"Date:"]
[null,"Depart","Destin","Depart","Arrive","Depart",null,"Arrive",null,"Hobbs","PAX","Lbs","H2O","Sling","Short-","Acct","Use","Flight","Non-",null,null,null,null,null,null,null,null,null,null,null,"Grand Total for Daily Helicopter Cost =",null,null,null,null,null,null,null,null,null,{"$f":"SUM(AO51:AX56)","v":3695},null,null,null,null,null,null,null,null,null,null,null,{"$f":"AS9","v":"Tyler Maine"},null,null,null,null,null,null,null,null,null,null,null,null,null,null,{"$f":"N5","v":"2023-05-01"}]
[null,"From","To","Clock","Clock","Hobbs",null,"Hobbs",null,"Total",null,"Cargo","Buckts","Loads","Haul",null,"Code","Time","Revnue",null,null,null,null,null,null,null,null,null,null,null,null,null,null,null,null,null,null,null,null,null,null,null,null,null,null,null,null,null,null,null,null,null,null,null,null,null,null,null,null,null,null,null,null,null,null,null,null,null,null,null,null,null,"Exceeds = Allowable Exceeded",null,null,null,{"$f":"IF(CD68=\"\",\"\",IF(CD68>BY55,\"Exceeds\",\"OK\"))","v":""},null,{"$f":"IF(CD68=\"\",\"\",IF(CD68>CA55,\"Exceeds\",\"OK\"))","v":""},null,null,{"$f":"IF(CD68=\"\",\"\",IF(CD68>CD55,\"Exceeds\",\"OK\"))","v":""},null,null,null,null,null,"Exceeds = Allowable Exceeded",null,null,null,{"$f":"IF(CS68=\"\",\"\",IF(CS68>CN55,\"Exceeds\",\"OK\"))","v":""},null,{"$f":"IF(CS68=\"\",\"\",IF(CS68>CP55,\"Exceeds\",\"OK\"))","v":""},null,null,{"$f":"IF(CS68=\"\",\"\",IF(CS68>CS55,\"Exceeds\",\"OK\"))","v":""}]
[null,null,null,"Time","Time",null,null,null,null,null,null,null,null,null,"Evols",null,null,"Cost","flight?",null,null,"*For full availability enter 1, otherwise enter 14 minus # of hours unavailable",null,null,null,null,null,null,null,null,null,null,null,null,null,null,{"$f":"A1","v":"SuperManager v3.23 SEKI"},null,null,null,null,null,null,null,"HCM-15 (REQUIRED)",null,null,null,null,null,null,null,null,null,null,"             NFES #1088",null,null,{"$f":"A1","v":"SuperManager v3.23 SEKI"},null,null,null,null,null,null,null,"HCM-1 (REQUIRED)"]
[null,null,null,null,null,null,null,null,null,null,null,null,null,null,null,{"$f":"A1","v":"SuperManager v3.23 SEKI"},null,null,null,null,null,null,null,null,null,null,null,null,null,null,null,null,null,null,null,null,null,null,null,null,null,null,null,null,null,null,null,null,null,null,null,null,null,null,null,null,null,null,null,null,null,null,null,null,null,null,null,null,null,null,null,14,"PASSENGERS/CARGO",null,null,null,null,null,null,null,null,null,null,null,null,null,14,"PASSENGERS/CARGO"]
[]
[]
[]
[]
[]
[null,null,null,null,null,null,null,null,null,null,null,null,null,null,null,null,null,null,"Aviation Personnel Daily Cost Summary"]
[]
[null,null,null,null,null,null,null,null,null,null,null,null,null,null,null,null,null,null,null,null,null,null,null,null,null,null,null,null,null,null,null,null,null,null,null,null,null,null,null,null,null,null,null,null,null,null,null,null,null,null,null,null,null,null,null,null,null,null,null,null,null,null,null,null,null,null,null,null,null,null,null,15,"ACTUAL PAYLOAD  (Total of all weights listed in Item 14)                                                               Line 15 must not exceed Line 13 for the intended mission (HIGE, HOGE or HOGE-J)",null,null,null,null,null,null,null,null,{"$f":"IF(CD60+CD62+CD64+CD66=0,\"\",SUM(CD60:CG67))","v":""},null,null,null,null,15,"ACTUAL PAYLOAD  (Total of all weights listed in Item 14)                                                               Line 15 must not exceed Line 13 for the intended mission (HIGE, HOGE or HOGE-J)",null,null,null,null,null,null,null,null,{"$f":"IF(CS60+CS62+CS64+CS66=0,\"\",SUM(CS60:CV67))","v":""}]
[null,null,null,null,null,null,null,null,null,null,null,null,null,null,null,null,"Crew Name:",null,"SEKI Helitack",null,null,null,null,null,null,null,null,null,"Date:",null,{"$f":"N5","v":"2023-05-01"},null,null,null,null,"  Incident/Project:",null,null,null,null,null,{"$f":"AI7","v":"SEKI Test #2"},null,null,null,null,null,null,null,null,"Account:",null,null,"PF.FPAMD1022.00.1"]
[]
[null,null,null,null,null,null,null,null,null,null,null,null,null,null,null,null,null,null,null,null,null,null,"Pay",null,"Regular TIme (RT)",null,null,null,null,null,null,null,null,null,null,null,"Overtime (OT)",null,null,null,null,null,null,null,null,null,null,null,"Hazard (Haz)",null,null,null,null,"Travel (Trv)",null,null,null,null,null,null,null,null,null,null,null,null,null,null,null,null,null,"PILOT SIGNATURE",null,null," ",null,null,null,null,null,null,"HazMat Onboard",null,null,null,null,"PILOT SIGNATURE",null,null," ",null,null,null,null,null,null,"HazMat Onboard"]
[null,"Name",null,"Lieu Days",null,"Quals",null,null,null,null,null,null,null,null,null,null,"Name",null,"Position",null,null,null,"Grade",null,"Begin",null,"End",null,"Break",null,"Hours",null,"Rate",null,"Cost",null,"Begin",null,"End",null,"Break",null,"Hours",null,"Rate",null,"Cost",null,"Hours",null,"Prmum",null,"Pay","Lodge","M&IE","Other","Total"]
[null,{"$f":"Q73","v":"Tyler Wayne"},null,"Thurs/Fri",null,"HEBM, HMGB, ICT4, SHLS, FAL2, PLDO, FIRB",null,null,null,null,null,null,null,null,null,null,"Tyler Wayne",null,"Assistant Manager",null,null,null,"GS-8/4",null,"08:00:00",null,"16:30:00",null,"00:30:00",null,{"$f":"IF(AA73-Y73=0,\"\",AA73-Y73-AC73)","v":"08:00:00"},null,26.11,null,{"$f":"IF(AG73=\"\",\"\",IF(AE73=\"\",\"\",AE73*AG73*24))","v":208.88000000000005},null,"07:00:00",null,"17:00:00",null,null,null,{"$f":"IF(AM73-AK73=0,\"\",AM73-AK73-AO73)","v":"10:00:00"},null,{"$f":"IF(AG73*1.5=0,\"\",IF(AG73*1.5>'Contract Info'!$D$38,'Contract Info'!$D$38,AG73*1.5))","v":39.164999999999999},null,{"$f":"IF(AS73=\"\",\"\",IF(AQ73=\"\",\"\",AQ73*AS73*24))","v":391.65000000000003},null,"09:00:00",null,0.25,null,{"$f":"IF(AG73*AW73=0,\"\",PRODUCT(AG73,$AY73,AW73,24))","v":58.747500000000002},null,null,null,{"$f":"SUM(BB73:BD73)","v":0},null,null,null,null,null,null,null,null,null,null,null,null,null,null,"MANAGER SIGNATURE",null,null," ",null,null,null,null,null,null,"YES","X","NO",null,null,"MANAGER SIGNATURE",null,null," ",null,null,null,null,null,null,"YES",null,"NO"]
[null,"PJ Nutall",null,"Sun/Mon",null,"HEBM(t), HMGB, ICT4, SHLS, FAL3, PLDO, FIRB",null,null,null,null,null,null,null,null,null,null,"PJ Nutall",null,"Lead Crew","Asst. Manager",null,null,"GS-7/8",null,"08:00:00",null,"16:30:00",null,"00:30:00",null,{"$f":"IF(AA74-Y74=0,\"\",AA74-Y74-AC74)","v":"08:00:00"},null,26.44,null,{"$f":"IF(AG74=\"\",\"\",IF(AE74=\"\",\"\",AE74*AG74*24))","v":211.52000000000004},null,null,null,null,null,null,null,{"$f":"IF(AM74-AK74=0,\"\",AM74-AK74-AO74)","v":""},null,{"$f":"IF(AG74*1.5=0,\"\",IF(AG74*1.5>'Contract Info'!$D$38,'Contract Info'!$D$38,AG74*1.5))","v":39.660000000000004},null,{"$f":"IF(AS74=\"\",\"\",IF(AQ74=\"\",\"\",AQ74*AS74*24))","v":""},null,null,null,0.25,null,{"$f":"IF(AG74*AW74=0,\"\",PRODUCT(AG74,$AY74,AW74,24))","v":""},null,null,null,{"$f":"SUM(BB74:BD74)","v":0}]
[null,"Melissa McBurger",null,"Wed/Thurs",null,"HEBM, HMGB, ICT4(t), SHLR, AEMF, PLDO, FIRB",null,null,null,null,null,null,null,null,null,null,"Melissa McBurger",null,"Lead Crew","Manager Trainee",null,null,"GS-6/6",null,"08:00:00",null,"16:30:00",null,"00:30:00",null,"08:00:00",null,22.51,null,180.08000000000004,null,null,null,null,null,null,null,"",null,{"$f":"IF(AG75*1.5=0,\"\",IF(AG75*1.5>'Contract Info'!$D$38,'Contract Info'!$D$38,AG75*1.5))","v":33.765000000000001},null,"",null,null,null,0.25,null,"",null,null,null,0,null,null,null,null,null,null,null,null,null,null,null,null,null,null,null,null,null,null,null,null,null,{"$f":"A1","v":"SuperManager v3.23 SEKI"},null,null,null,null,null,"HCM-8 ",null,null,null,null,null,null,null,null,{"$f":"A1","v":"SuperManager v3.23 SEKI"},null,null,null,null,null,"HCM-8 "]
[null,"Damian Lorna",null,"Sat/Sun",null,"HMGB, ICT4(t), SHLS, FAL2, PLDO(t)",null,null,null,null,null,null,null,null,null,null,"Damian Lorna",null,"Sr. Crewmember","Manager Trainee",null,null,"GS-5",null,"08:00:00",null,"16:30:00",null,"00:30:00",null,"08:00:00",null,17.309999999999999,null,138.48000000000002,null,null,null,null,null,null,null,"",null,{"$f":"IF(AG76*1.5=0,\"\",IF(AG76*1.5>'Contract Info'!$D$38,'Contract Info'!$D$38,AG76*1.5))","v":25.964999999999996},null,"",null,null,null,0.25,null,"",null,null,null,0]
[null,"Erik Anders",null,"Fri/Sat",null,"HECM, FFT1(t), SHLR, FAL3, EMTF, ABRO(t)",null,null,null,null,null,null,null,null,null,null,"Erik Anders",null,"Crewmember","Manager Trainee",null,null,"GS-4",null,"08:00:00",null,"16:30:00",null,"00:30:00",null,"08:00:00",null,15.92,null,127.36000000000001,null,null,null,null,null,null,null,"",null,{"$f":"IF(AG77*1.5=0,\"\",IF(AG77*1.5>'Contract Info'!$D$38,'Contract Info'!$D$38,AG77*1.5))","v":23.88},null,"",null,null,null,0.25,null,"",null,null,null,0]
[null,"Chandra Homer",null,"Mon/Tues",null,"HECM(t), FFT1(t), EMTF",null,null,null,null,null,null,null,null,null,null,"Chandra Homer",null,"Crewmember","Manager Trainee",null,null,"GS-4",null,"08:00:00",null,"16:30:00",null,"00:30:00",null,"08:00:00",null,15.92,null,127.36000000000001,null,null,null,null,null,null,null,"",null,{"$f":"IF(AG78*1.5=0,\"\",IF(AG78*1.5>'Contract Info'!$D$38,'Contract Info'!$D$38,AG78*1.5))","v":23.88},null,"",null,null,null,0.25,null,"",null,null,null,0]
[null,"Larry Goodbush",null,"Tues/Wed",null,"HECM(t), FFT1(t)",null,null,null,null,null,null,null,null,null,null,"Larry Goodbush",null,"Crewmember","Manager Trainee",null,null,"GS-4",null,"08:00:00",null,"16:30:00",null,"00:30:00",null,"08:00:00",null,15.92,null,127.36000000000001,null,null,null,null,null,null,null,"",null,{"$f":"IF(AG79*1.5=0,\"\",IF(AG79*1.5>'Contract Info'!$D$38,'Contract Info'!$D$38,AG79*1.5))","v":23.88},null,"",null,null,null,0.25,null,"",null,null,null,0]
[null,0,null,null,null,null,null,null,null,null,null,null,null,null,null,null,null,null,null,"Crewmember",null,null,null,null,null,null,null,null,null,null,"",null,null,null,"",null,null,null,null,null,null,null,"",null,{"$f":"IF(AG80*1.5=0,\"\",IF(AG80*1.5>'Contract Info'!$D$38,'Contract Info'!$D$38,AG80*1.5))","v":""},null,"",null,null,null,0.25,null,"",null,null,null,0]
[null,0,null,null,null,null,null,null,null,null,null,null,null,null,null,null,null,null,null,"Crewmember",null,null,null,null,null,null,null,null,null,null,"",null,null,null,"",null,null,null,null,null,null,null,"",null,{"$f":"IF(AG81*1.5=0,\"\",IF(AG81*1.5>'Contract Info'!$D$38,'Contract Info'!$D$38,AG81*1.5))","v":""},null,"",null,null,null,0.25,null,"",null,null,null,0]
[null,0,null,null,null,null,null,null,null,null,null,null,null,null,null,null,null,null,null,"Crewmember",null,null,null,null,null,null,null,null,null,null,"",null,null,null,"",null,null,null,null,null,null,null,"",null,{"$f":"IF(AG82*1.5=0,\"\",IF(AG82*1.5>'Contract Info'!$D$38,'Contract Info'!$D$38,AG82*1.5))","v":""},null,{"$f":"IF(AS82=\"\",\"\",IF(AQ82=\"\",\"\",AQ82*AS82*24))","v":""},null,null,null,0.25,null,"",null,null,null,0]
[null,null,null,null,null,null,null,null,null,null,null,null,null,null,null,null,null,null,null,null,null,"Total Personnel Regular Time (Base Pay) Cost",null,null,null,null,null,null,null,null,null,null,null,{"$f":"SUM(AI73:AJ82)","v":1121.0400000000002},null,null,null,null,null,null,null,null,null,null,null,null,null,null,null,null,null,null,null,{"$f":"SUM(BB73:BB82)","v":0},{"$f":"SUM(BC73:BC82)","v":0},{"$f":"SUM(BD73:BD82)","v":0}]
[null,"Notes:","TOD for helitack 0800-1630 M-F until May 22nd then switches to 7 day coverage.",null,null,null,null,null,null,null,null,null,null,null,null,null,null,null,null,null,null,"Total Personnel Premium Pay (OT + Haz + Trv) Cost",null,null,null,null,null,null,null,null,null,null,null,null,null,null,{"$f":"AT84+AZ84+BE84","v":450.39750000000004},null,null,null,null,null,null,"=",null,{"$f":"SUM(AU73:AV82)","v":391.65000000000003},null,null,null,"+",null,{"$f":"SUM(BA73:BA82)","v":58.747500000000002},null,"+",null,null,{"$f":"SUM(BE73:BE82)","v":0}]
[]
[null,null,null,null,null,null,null,null,null,null,null,null,null,null,null,null,null,null,null,null,null,null,"     Helicopter Daily Cost Summary"]
[null,null,null,null,null,null,null,null,null,null,null,null,null,null,null,null,"Helicopter:",null,{"$f":"'Contract Info'!D3","v":"N836TJ"},null,null,null,null,null,null,null,null,null,null,null,null,null,null,null,null,null,null,null,null,null,null,null,null,null,null,"Notes:"]
[null,null,null,null,null,null,null,null,null,null,null,null,null,null,null,null,"Make/Model:",null,{"$f":"'Contract Info'!D4","v":"Airbus H-125"},null,null,null,null,null,null,null,"Rate",null,null,"Total",null,null,"Surchrge",null,"Surcharge",null,null,"Total",null,null,null,null,null,null,null,"This is simply a test…."]
[null,null,null,null,null,null,null,null,null,null,null,null,null,null,null,null,"Contractor:",null,{"$f":"N6","v":"Butterfly Airways, Inc."},null,null,null,"Persons",null,"Quantity",null,null,null,null,null,null,null,"%",null,"Total",null,null,"w/ Surcharge"]
[null,null,null,null,null,null,null,null,null,null,null,null,null,null,null,null,"Flight Time",null,null,null,null,null,null,null,{"$f":"AH16","v":2.7000000000000028},null,{"$f":"AM16","v":1325},null,null,{"$f":"AS16","v":3577.5000000000036},null,null,0,null,{"$f":"PRODUCT(AD90,AG90)","v":0},null,null,{"$f":"SUM(AD90,AI90)","v":3577.5000000000036}]
[null,null,null,null,null,null,null,null,null,null,null,null,null,null,null,null,"Availability (hours or day)",null,null,null,null,null,null,null,{"$f":"AH18","v":1},null,{"$f":"AM18","v":3695},null,null,{"$f":"AS18","v":3695},null,null,-1,null,-3695,null,null,0]
[null,null,null,null,null,null,null,null,null,null,null,null,null,null,null,null,"Pilot Extended Standby",null,null,null,null,null,{"$f":"AE20","v":1},null,{"$f":"AH20","v":"0"},null,{"$f":"AM20","v":52},null,null,{"$f":"AS20","v":0},null,null,0,null,0,null,null,0]
[null,null,null,null,null,null,null,null,null,null,null,null,null,null,null,null,"Driver Extended Standby",null,null,null,null,null,{"$f":"AE22","v":0},null,{"$f":"AH22","v":"0"},null,{"$f":"AM22","v":39},null,null,{"$f":"AS22","v":0},null,null,0,null,0,null,null,0]
[null,null,null,null,null,null,null,null,null,null,null,null,null,null,null,null,"Mechanic  Extended Standby",null,null,null,null,null,{"$f":"AE24","v":1},null,{"$f":"AH24","v":2.59},null,{"$f":"AM24","v":59.59},null,null,{"$f":"AS24","v":154.3381},null,null,0,null,0,null,null,154.3381]
[null,null,null,null,null,null,null,null,null,null,null,null,null,null,null,null,"Per Diem or RON",null,null,null,null,null,{"$f":"AE26","v":2},null,null,null,{"$f":"AM26","v":169},null,null,{"$f":"AS26","v":338},null,null,0,null,0,null,null,338]
[null,null,null,null,null,null,null,null,null,null,null,null,null,null,null,null,"Service Truck Miles",null,null,null,null,null,null,null,{"$f":"AH28","v":20},null,{"$f":"AM28","v":2.4500000000000002},null,null,{"$f":"AS28","v":49},null,null,0,null,0,null,null,49]
[null,null,null,null,null,null,null,null,null,null,null,null,null,null,null,null,"Additnl Crew Extended Standby",null,null,null,null,null,{"$f":"AE30","v":0},null,{"$f":"AH30","v":0},null,{"$f":"AM30","v":10},null,null,{"$f":"AS30","v":0},null,null,0,null,0,null,null,0]
[null,null,null,null,null,null,null,null,null,null,null,null,null,null,null,null,"Add'l Cost:",null,{"$f":"Z32","v":0},null,null,null,{"$f":"AE32","v":0},null,{"$f":"AH32","v":0},null,{"$f":"AM32","v":0},null,null,{"$f":"AS32","v":0},null,null,0,null,0,null,null,0]
[null,null,null,null,null,null,null,null,null,null,null,null,null,null,null,null,"Add'l Cost:",null,{"$f":"Z34","v":0},null,null,null,{"$f":"AE34","v":0},null,{"$f":"AH34","v":0},null,{"$f":"AM34","v":0},null,null,{"$f":"AS34","v":0},null,null,0,null,0,null,null,0]
[null,null,null,null,null,null,null,null,null,null,null,null,null,null,null,null,"Add'l Cost:",null,{"$f":"Z36","v":0},null,null,null,{"$f":"AE36","v":0},null,{"$f":"AH36","v":0},null,{"$f":"AM36","v":0},null,null,{"$f":"AS36","v":0},null,null,0,null,0,null,null,0]
[null,null,null,null,null,null,null,null,null,null,null,null,null,null,null,null,"Add'l Cost:",null,null,null,null,null,null,null,null,null,null,null,null,{"$f":"PRODUCT(W101,Y101,AA101)","v":0},null,null,0,null,0,null,null,0]
[null,null,null,null,null,null,null,null,null,null,null,null,null,null,null,null,null,null,null,null,null,"Total Helicopter Costs",null,null,null,null,null,null,null,null,null,null,null,null,null,null,{"$f":"SUM(AL90:AN101)","v":4118.8381000000036}]
[null,null,null,null,null,null,null,null,null,null,null,null,null,null,null,null,null,null,null,null,null,null,null,null,null,null,null,null,null,null,null,null,null,null,null,null,null,null,null,null,null,null,null,null,null,{"$f":"BH18","v":"Wilderness Flight Time"},null,null,null,null,null,null,null,null,null,null,{"$f":"BN18","v":5}]
[null,null,null,null,null,null,null,null,null,null,null,null,null,null,null,null,null,null,null,null,null,null,null,null,null,null,null,null,null,null,null,null,null,null,null,null,null,null,null,null,null,null,null,null,null,{"$f":"BH20","v":"Wilderness Landings"},null,null,null,null,null,null,null,null,null,null,{"$f":"BN20","v":4}]
[null,null,null,null,null,null,null,null,null,null,null,null,null,null,null,null,null,null,"Your Cost",null,null,"       Your Cost","N","Include personnel base hours in total cost (Y or N)",null,null,null,null,null,null,null,null,null,null,null,null,null,null,null,null,null,null,null,null,null,{"$f":"BH22","v":"Wilderness Ext. Load Deliveries or Pickups (non-s-h)"},null,null,null,null,null,null,null,null,null,null,{"$f":"BN22","v":3}]
[null,null,null,null,null,null,null,null,null,null,null,null,null,null,null,null,null,null,null,null,null,null,null,null,null,null,null,null,null,null,null,null,null,null,null,null,null,null,null,null,null,null,null,null,null,{"$f":"BH24","v":"Wilderness Short-hauls"},null,null,null,null,null,null,null,null,null,null,{"$f":"BN24","v":2}]
[null,null,null,null,null,null,null,null,null,null,null,null,null,null,null,null,{"$f":"IF(W105=\"y\",\"Total Personnel Base and Premium Pay + Helicopter Costs\",IF(W105=\"Y\",\"Total Personnel Base and Premium Pay + Helicopter Costs\",IF(W105=\"yes\",\"Total Personnel Base and Premium Pay + Helicopter Costs\",IF(W105=\"YES\",\"Total Personnel Base and Premium Pay + Helicopter Costs\",IF(W105=\"Yes\",\"Total Personnel Base and Premium Pay + Helicopter Costs\",\"Total Personnel Premium Pay + Helicopter Costs\")))))","v":"Total Personnel Premium Pay + Helicopter Costs"},null,null,null,null,null,null,null,null,null,null,null,null,null,null,null,null,null,null,null,{"$f":"IF(W105=\"y\",SUM(AK84,AH83,AK102),IF(W105=\"Y\",SUM(AK84,AH83,AK102),IF(W105=\"yes\",SUM(AK84,AH83,AK102),IF(W105=\"YES\",SUM(AK84,AH83,AK102),IF(W105=\"Yes\",SUM(AK84,AH83,AK102),SUM(AK84,AK102))))))","v":4569.2356000000036},null,null,null,null,null,null,null,null,{"$f":"BH26","v":"Initial Attacks"},null,null,null,null,null,null,null,null,null,null,{"$f":"BN26","v":1}]
[null,null,null,null,null,null,null,null,null,null,null,null,null,null,null,null,null,null,null,null,null,null,null,null,null,null,null,null,null,null,null,null,null,null,null,null,null,null,null,null,null,null,null,null,null,null,null,null,null,null,null,null,null,null,{"$f":"A1","v":"SuperManager v3.23 SEKI"}]
[]
[]
[]
[]
[]
[]
[]
[]
[]
[]
[]
[]
[]
[]
[]
[]
[]
[]
[]
[]
[]
[]
[]
[]
[]
[]
[]
[]
[null,null,null,null,null,null,null,null,null,null,null,"Lbs","H2O","Retard","Foam",null,"Use","Time","Revnue"]
[null,null,null,null,null,null,null,null,null,null,"PAX","Cargo","Buckts","Buckts","Buckts","Acct","Code","Cost","flight?"]
[null,null,null,null,null,null,null,null,null,null,{"$f":"IF($S29=\"\",K29,\"\")","v":2},320,0,0,0,null,null,{"$f":"IF($S29=\"\",R29,\"\")","v":1375}]
[null,null,null,null,null,null,null,null,null,null,0,622,0,1,0,null,null,1375]
[null,null,null,null,null,null,null,null,null,null,0,{"$f":"IF($S31=\"\",L31,\"\")","v":555},0,0,1,null,null,412.49999999999608]
[null,null,null,null,null,null,null,null,null,null,0,0,1,0,0,null,null,550.00000000000784]
[null,null,null,null,null,null,null,null,null,null,0,0,0,0,0,null,null,""]
[null,null,null,null,null,null,null,null,null,null,0,0,0,0,0,null,null,""]
[null,null,null,null,null,null,null,null,null,null,0,0,0,0,0,null,null,""]
[null,null,null,null,null,null,null,null,null,null,0,0,0,0,0,null,null,""]
[null,null,null,null,null,null,null,null,null,null,0,0,0,0,0,null,null,""]
[null,null,null,null,null,null,null,null,null,null,0,0,0,0,0,null,null,""]
[null,null,null,null,null,null,null,null,null,null,0,0,0,0,0,null,null,""]
[null,null,null,null,null,null,null,null,null,null,0,0,0,0,0,null,null,""]
[null,null,null,null,null,null,null,null,null,null,0,0,0,0,0,null,null,""]
[null,null,null,null,null,null,null,null,null,null,0,0,0,0,0,null,null,""]
[null,null,null,null,null,null,null,null,null,null,0,0,0,0,0,null,null,""]
[null,null,null,null,null,null,null,null,null,null,0,0,0,0,0,null,null,""]
[null,null,null,null,null,null,null,null,null,null,{"$f":"IF($S45=\"\",K45,\"\")","v":0},0,0,0,0,null,null,""]
[null,null,null,null,null,null,null,null,null,null,0,0,0,0,0,null,null,""]
[null,null,null,null,null,null,null,null,null,null,0,0,0,0,0,null,null,""]
[null,null,null,null,null,null,null,null,null,null,0,0,0,0,0,null,null,""]
[null,null,null,null,null,null,null,null,null,null,0,0,0,0,0,null,null,""]
[null,null,null,null,null,null,null,null,null,null,0,0,0,0,0,null,null,""]
[null,null,null,null,null,null,null,null,null,null,0,0,0,0,0,null,null,""]
[null,null,null,null,null,null,null,null,null,null,0,0,0,0,0,null,null,""]
[null,null,null,null,null,null,null,null,null,null,0,0,0,0,0,null,null,""]
[null,null,null,null,null,null,null,null,null,null,0,0,0,0,0,null,null,""]
[null,null,null,null,null,null,null,null,null,null,0,0,0,0,0,null,null,""]
[null,null,null,null,null,null,null,null,null,null,{"$f":"SUM(K139:K165)","v":2},1497,1,1,1,null,null,3712.5000000000036]
[null,null,null,null,null,null,null,null,null,null,"PAX","Lbs","H2O","Retard","Foam","Acct","Use","Flight","Non-"]
[null,null,null,null,null,null,null,null,null,null,null,"Cargo","Buckts","Buckts","Buckts",null,"Code","Time","revenue"]
[null,null,null,null,null,null,null,null,null,null,null,null,null,null,null,null,null,"Cost","flight?"]
[]
[]
[]
[]
[]
[]
[]
[null,null,null,null,null,null,null,null,null,null,{"$f":"K69","v":0}]

{"sheet":"2-May-23","index":5,"n_rows":177,"n_cols":100,"rows_kept":177,"cut":false,"hidden":false,"merged":[[0,0,0,19],[0,20,0,50],[0,51,0,70],[0,71,0,99],[1,4,2,14],[1,20,2,50],[1,52,2,54],[1,55,2,65],[1,71,6,77],[1,78,3,79],[6,59,6,64],[6,65,6,69],[1,80,3,84],[1,86,6,92],[1,93,3,94],[1,95,3,99],[3,1,3,18],[4,1,4,2],[4,3,4,8],[4,13,4,14],[4,44,4,45],[4,46,4,49],[6,21,6,24],[6,25,6,29],[6,30,6,33],[6,34,6,40],[6,41,6,44],[6,45,6,49],[4,93,6,94],[4,95,6,99],[5,1,5,2],[5,3,5,6],[5,13,5,17],[5,52,5,54],[5,55,5,58],[5,59,5,63],[5,64,5,69],[6,16,6,17],[4,52,4,53],[4,54,4,56],[4,65,4,66],[4,67,4,69],[4,78,6,79],[4,80,6,84],[6,52,6,54],[6,55,6,58],[7,1,7,3],[7,5,7,7],[7,9,7,13],[7,52,7,54],[7,55,7,58],[7,71,9,72],[8,59,8,60],[8,63,8,64],[8,66,8,67],[9,2,9,3],[9,5,9,7],[9,9,9,13],[9,53,9,58],[9,59,9,61],[9,63,9,64],[9,66,9,67],[7,95,9,99],[8,5,8,8],[8,9,8,13],[8,21,8,22],[8,23,8,25],[8,27,8,31],[8,32,8,37],[8,38,8,43],[8,44,8,49],[8,52,8,54],[7,73,9,77],[7,78,9,79],[7,80,9,84],[7,86,9,87],[7,88,9,92],[7,93,9,94],[10,86,12,87],[10,88,12,92],[10,93,12,94],[10,95,12,99],[10,39,10,43],[10,44,10,49],[10,52,10,58],[10,59,10,69],[10,71,12,72],[10,73,12,77],[12,52,12,58],[12,59,12,69],[11,53,11,58],[11,60,11,69],[12,2,12,3],[12,5,12,7],[12,9,12,13],[12,21,12,33],[12,34,12,37],[10,78,12,79],[10,80,12,84],[10,2,10,3],[10,5,10,7],[10,9,10,13],[10,21,10,22],[10,28,10,30],[10,32,10,37],[13,2,13,3],[13,5,13,13],[13,30,14,32],[13,33,14,37],[13,38,14,43],[13,44,14,49],[14,2,14,3],[14,5,14,13],[11,2,11,3],[11,5,11,7],[11,9,11,13],[13,53,13,58],[13,60,13,69],[13,71,15,71],[13,72,15,73],[13,74,15,77],[13,78,15,78],[14,59,14,64],[14,65,14,69],[15,52,16,54],[15,55,16,55],[13,89,15,92],[13,93,15,93],[13,94,15,95],[13,96,15,96],[13,97,15,98],[13,99,15,99],[13,79,15,80],[13,81,15,81],[13,82,15,83],[13,84,15,84],[13,86,15,86],[13,87,15,88],[15,56,16,56],[15,57,16,57],[15,58,16,58],[15,59,16,64],[15,65,16,67],[15,68,16,69],[15,2,15,3],[15,21,16,29],[15,30,16,32],[15,33,16,37],[15,38,16,43],[15,44,16,49],[16,5,16,11],[16,13,17,14],[16,15,17,15],[16,16,17,16],[17,68,18,69],[16,93,18,93],[16,94,18,95],[16,96,18,96],[16,97,18,98],[16,99,18,99],[17,5,17,6],[17,7,17,8],[17,21,18,29],[17,30,18,32],[17,33,18,37],[16,81,18,81],[16,82,18,83],[16,84,18,84],[16,86,18,86],[16,87,18,88],[16,89,18,92],[16,17,17,17],[16,71,18,71],[16,72,18,73],[16,74,18,77],[16,78,18,78],[16,79,18,80],[17,38,18,43],[19,59,20,64],[19,65,20,67],[19,21,20,29],[19,30,20,32],[19,33,20,37],[19,38,20,43],[19,44,20,49],[19,52,20,54],[18,5,18,6],[18,7,18,8],[18,13,18,14],[19,5,19,6],[19,7,19,8],[19,13,19,14],[17,56,18,56],[17,57,18,57],[17,58,18,58],[17,59,18,64],[17,65,18,67],[17,44,18,49],[17,52,18,54],[17,55,18,55],[20,2,20,3],[20,5,20,6],[20,7,20,8],[20,13,20,14],[21,5,21,6],[21,7,21,8],[21,21,22,29],[21,30,22,32],[21,33,22,37],[22,93,24,99],[21,58,22,58],[21,59,22,64],[21,65,22,67],[21,68,22,69],[22,5,22,6],[22,7,22,8],[21,38,22,43],[21,44,22,49],[21,52,22,54],[21,55,22,55],[21,56,22,56],[21,57,22,57],[19,93,21,99],[19,68,20,69],[19,71,21,71],[19,72,21,77],[19,78,21,84],[19,86,21,86],[19,87,21,92],[19,55,20,55],[19,56,20,56],[19,57,20,57],[19,58,20,58],[23,33,24,37],[23,38,24,43],[23,44,24,49],[23,52,24,54],[22,71,24,71],[22,72,24,77],[22,78,24,84],[22,86,24,86],[22,87,24,92],[25,55,26,55],[25,56,26,56],[25,57,26,57],[25,58,26,58],[25,59,26,64],[25,65,26,67],[23,68,24,69],[24,1,24,18],[25,5,25,6],[25,7,25,8],[25,21,26,29],[25,30,26,32],[25,33,26,37],[25,38,26,43],[25,44,26,49],[25,52,26,54],[23,55,24,55],[23,56,24,56],[23,57,24,57],[23,58,24,58],[23,59,24,64],[23,65,24,67],[23,21,24,29],[23,30,24,32],[25,78,27,84],[25,86,27,86],[25,87,27,88],[25,89,27,89],[25,90,27,90],[25,68,26,69],[25,71,27,71],[25,72,27,73],[25,74,27,74],[25,75,27,75],[25,76,27,76],[28,93,30,99],[27,58,28,58],[27,59,28,64],[27,65,28,67],[27,68,28,69],[28,5,28,6],[28,7,28,8],[27,38,28,43],[27,44,28,49],[27,52,28,54],[27,55,28,55],[27,56,28,56],[27,57,28,57],[25,91,27,91],[25,92,27,92],[25,93,27,99],[26,5,26,6],[26,7,26,8],[27,5,27,6],[27,7,27,8],[27,21,28,29],[27,30,28,32],[27,33,28,37],[25,77,27,77],[31,96,31,99],[32,93,32,95],[32,96,32,99],[29,44,30,49],[30,5,30,6],[30,7,30,8],[30,52,34,69],[31,5,31,6],[31,7,31,8],[31,21,32,24],[31,25,32,29],[31,30,32,32],[31,33,32,37],[29,5,29,6],[29,7,29,8],[29,21,30,29],[29,30,30,32],[29,33,30,37],[29,38,30,43],[28,71,30,71],[28,72,30,77],[28,78,30,84],[28,86,30,86],[28,87,30,92],[32,5,32,6],[32,7,32,8],[32,76,32,77],[32,78,32,80],[32,81,32,84],[32,91,32,92],[31,38,32,43],[31,44,32,49],[31,76,31,80],[31,81,31,84],[31,91,31,95],[33,86,35,86],[33,87,35,90],[33,91,35,92],[33,93,35,95],[33,96,35,99],[33,38,34,43],[33,44,34,49],[33,71,35,71],[33,72,35,75],[33,76,35,77],[33,78,35,80],[35,38,36,43],[35,44,36,49],[36,52,50,69],[36,71,38,71],[35,5,35,6],[35,7,35,8],[35,21,36,24],[35,25,36,29],[35,30,36,32],[35,33,36,37],[36,5,36,6],[36,7,36,8],[33,81,35,84],[33,5,33,6],[33,7,33,8],[33,21,34,24],[33,25,34,29],[33,30,34,32],[33,33,34,37],[34,5,34,6],[34,7,34,8],[36,91,38,92],[36,93,38,95],[36,96,38,99],[37,5,37,6],[37,7,37,8],[37,34,38,43],[37,44,38,49],[38,5,38,6],[38,7,38,8],[36,72,38,75],[36,76,38,77],[36,78,38,80],[36,81,38,84],[36,86,38,86],[36,87,38,90],[39,81,41,84],[39,86,41,86],[39,87,41,90],[39,91,41,92],[39,93,41,95],[39,96,41,99],[39,5,39,6],[39,7,39,8],[39,71,41,71],[39,72,41,75],[39,76,41,77],[39,78,41,80],[40,5,40,6],[40,7,40,8],[40,21,41,25],[40,26,41,31],[40,32,41,37],[40,38,41,43],[40,44,41,49],[41,5,41,6],[41,7,41,8],[42,5,42,6],[42,7,42,8],[42,21,43,25],[42,26,43,31],[42,32,43,37],[42,81,44,84],[42,86,44,86],[42,87,44,90],[42,91,44,92],[42,93,44,95],[42,96,44,99],[42,38,43,43],[42,44,43,49],[42,71,44,71],[42,72,44,75],[42,76,44,77],[42,78,44,80],[43,5,43,6],[43,7,43,8],[44,5,44,6],[44,7,44,8],[44,32,44,38],[45,5,45,6],[45,7,45,8],[45,21,45,29],[45,30,45,39],[45,87,47,90],[45,91,47,92],[45,93,47,95],[45,96,47,99],[46,5,46,6],[46,7,46,8],[46,21,47,29],[46,30,47,39],[46,40,47,49],[45,40,45,49],[45,71,47,71],[45,72,47,75],[45,76,47,77],[45,78,47,80],[45,81,47,84],[47,5,47,6],[47,7,47,8],[48,5,48,6],[48,7,48,8],[48,71,50,71],[48,72,50,75],[50,30,50,39],[50,40,50,49],[45,86,47,86],[48,93,50,95],[48,96,50,99],[49,5,49,6],[49,7,49,8],[49,21,49,29],[49,30,49,39],[49,40,49,49],[50,5,50,6],[50,7,50,8],[50,21,50,29],[48,76,50,77],[48,78,50,80],[48,81,50,84],[48,86,50,86],[48,87,50,90],[48,91,50,92],[51,87,53,90],[51,91,53,92],[51,93,53,95],[51,96,53,99],[52,5,52,6],[52,7,52,8],[52,21,52,29],[52,30,52,39],[52,40,52,49],[52,52,54,69],[51,71,53,71],[51,72,53,75],[51,76,53,77],[51,78,53,80],[51,81,53,84],[51,86,53,86],[51,5,51,6],[51,7,51,8],[51,21,51,29],[51,30,51,39],[51,40,51,49],[51,52,51,69],[53,5,53,6],[53,7,53,8],[53,21,53,29],[53,30,53,39],[53,40,53,49],[54,5,54,6],[54,7,54,8],[54,21,54,29],[54,30,54,39],[54,40,54,49],[54,87,56,90],[54,91,56,92],[54,93,56,95],[54,96,56,99],[55,5,55,6],[55,7,55,8],[55,21,55,29],[55,30,55,39],[55,40,55,49],[55,52,55,57],[54,71,56,71],[54,72,56,75],[54,76,56,77],[54,78,56,80],[54,81,56,84],[54,86,56,86],[55,58,55,66],[55,67,55,69],[56,5,56,6],[56,7,56,8],[56,21,57,29],[56,30,57,39],[56,40,57,49],[56,52,57,57],[56,58,57,66],[56,67,57,69],[57,5,57,6],[57,7,57,8],[57,71,58,71],[57,72,58,75],[57,76,58,77],[57,78,58,80],[58,5,58,6],[58,7,58,8],[58,36,59,43],[58,44,59,50],[58,66,59,69],[59,15,59,18],[59,71,60,71],[57,81,58,84],[57,86,58,86],[57,87,58,90],[57,91,58,92],[57,93,58,95],[57,96,58,99],[65,18,66,41],[65,71,66,71],[65,72,66,80],[65,81,66,84],[65,86,66,86],[59,96,60,99],[60,0,63,19],[60,51,63,70],[61,71,62,71],[61,72,62,80],[61,81,62,84],[61,86,62,86],[61,87,62,95],[61,96,62,99],[63,71,64,71],[59,72,60,75],[59,76,60,80],[59,81,60,84],[59,86,60,86],[59,87,60,90],[59,91,60,95],[58,52,59,53],[58,55,59,57],[58,58,59,64],[65,87,66,95],[65,96,66,99],[67,71,69,71],[67,72,69,80],[67,81,69,84],[67,86,69,86],[67,87,69,95],[67,96,69,99],[63,72,64,80],[63,81,64,84],[63,86,64,86],[63,87,64,95],[63,96,64,99],[70,96,71,99],[68,18,68,26],[68,30,68,33],[68,41,68,47],[68,53,68,56],[70,22,70,23],[70,24,70,35],[70,36,70,47],[70,48,70,52],[70,53,70,56],[71,5,71,11],[71,16,71,17],[71,18,71,21],[71,22,71,23],[70,71,71,73],[70,74,71,80],[70,81,71,84],[70,86,71,88],[70,89,71,95],[71,48,71,49],[71,50,71,51],[72,1,72,2],[72,3,72,4],[72,5,72,11],[72,16,72,17],[72,18,72,21],[72,22,72,23],[72,24,72,25],[72,26,72,27],[71,36,71,37],[71,38,71,39],[71,40,71,41],[71,42,71,43],[71,44,71,45],[71,46,71,47],[71,24,71,25],[71,26,71,27],[71,28,71,29],[71,30,71,31],[71,32,71,33],[71,34,71,35],[71,1,71,2],[71,3,71,4],[72,40,72,41],[72,42,72,43],[72,44,72,45],[72,46,72,47],[72,48,72,49],[72,50,72,51],[72,28,72,29],[72,30,72,31],[72,32,72,33],[72,34,72,35],[72,36,72,37],[72,38,72,39],[72,86,73,88],[72,89,73,95],[72,96,73,96],[72,97,73,97],[72,98,73,98],[72,99,73,99],[72,71,73,73],[72,74,73,80],[72,81,73,81],[72,82,73,82],[72,83,73,83],[72,84,73,84],[74,1,74,2],[74,3,74,4],[74,5,74,11],[74,16,74,17],[74,18,74,21],[74,22,74,23],[74,24,74,25],[74,26,74,27],[73,36,73,37],[73,24,73,25],[73,26,73,27],[73,28,73,29],[73,30,73,31],[73,32,73,33],[73,34,73,35],[73,1,73,2],[73,3,73,4],[73,5,73,11],[73,16,73,17],[73,18,73,21],[73,22,73,23],[74,50,74,51],[74,28,74,29],[74,30,74,31],[74,32,74,33],[74,34,74,35],[74,36,74,37],[74,38,74,39],[73,48,73,49],[73,50,73,51],[73,38,73,39],[73,40,73,41],[73,42,73,43],[73,44,73,45],[73,46,73,47],[75,5,75,11],[75,16,75,17],[75,18,75,21],[75,22,75,23],[74,40,74,41],[74,42,74,43],[74,44,74,45],[74,46,74,47],[74,48,74,49],[75,48,75,49],[75,50,75,51],[76,1,76,2],[76,3,76,4],[76,5,76,11],[76,16,76,17],[76,18,76,21],[76,22,76,23],[76,24,76,25],[76,26,76,27],[75,36,75,37],[75,38,75,39],[75,40,75,41],[75,42,75,43],[75,44,75,45],[75,46,75,47],[75,24,75,25],[75,26,75,27],[75,28,75,29],[75,30,75,31],[75,32,75,33],[75,34,75,35],[75,1,75,2],[75,3,75,4],[76,40,76,41],[76,42,76,43],[76,44,76,45],[76,46,76,47],[76,48,76,49],[76,50,76,51],[76,28,76,29],[76,30,76,31],[76,32,76,33],[76,34,76,35],[76,36,76,37],[76,38,76,39],[78,1,78,2],[78,3,78,4],[78,5,78,11],[78,16,78,17],[78,18,78,21],[78,22,78,23],[78,24,78,25],[78,26,78,27],[77,36,77,37],[77,24,77,25],[77,26,77,27],[77,28,77,29],[77,30,77,31],[77,32,77,33],[77,34,77,35],[77,1,77,2],[77,3,77,4],[77,5,77,11],[77,16,77,17],[77,18,77,21],[77,22,77,23],[78,50,78,51],[78,28,78,29],[78,30,78,31],[78,32,78,33],[78,34,78,35],[78,36,78,37],[78,38,78,39],[77,48,77,49],[77,50,77,51],[77,38,77,39],[77,40,77,41],[77,42,77,43],[77,44,77,45],[77,46,77,47],[79,5,79,11],[79,16,79,17],[79,18,79,21],[79,22,79,23],[78,40,78,41],[78,42,78,43],[78,44,78,45],[78,46,78,47],[78,48,78,49],[79,48,79,49],[79,50,79,51],[80,1,80,2],[80,3,80,4],[80,5,80,11],[80,16,80,17],[80,18,80,21],[80,22,80,23],[80,24,80,25],[80,26,80,27],[79,36,79,37],[79,38,79,39],[79,40,79,41],[79,42,79,43],[79,44,79,45],[79,46,79,47],[79,24,79,25],[79,26,79,27],[79,28,79,29],[79,30,79,31],[79,32,79,33],[79,34,79,35],[79,1,79,2],[79,3,79,4],[80,46,80,47],[80,48,80,49],[80,50,80,51],[80,28,80,29],[80,30,80,31],[80,32,80,33],[80,34,80,35],[80,36,80,37],[80,38,80,39],[81,1,81,2],[81,3,81,4],[81,5,81,11],[81,16,81,17],[81,18,81,21],[81,22,81,23],[80,40,80,41],[80,42,80,43],[80,44,80,45],[81,48,81,49],[81,50,81,51],[82,21,82,32],[82,33,82,35],[82,36,82,37],[82,38,82,39],[82,40,82,41],[82,42,82,43],[82,44,82,45],[82,46,82,47],[81,36,81,37],[81,38,81,39],[81,40,81,41],[81,42,81,43],[81,44,81,45],[81,46,81,47],[81,24,81,25],[81,26,81,27],[81,28,81,29],[81,30,81,31],[81,32,81,33],[81,34,81,35],[82,48,82,49],[82,50,82,51],[83,2,106,11],[83,21,83,35],[83,36,83,39],[83,45,83,47],[83,51,83,52],[87,32,87,33],[87,34,87,36],[87,37,87,39],[83,53,83,55],[85,22,86,35],[86,16,86,17],[86,18,86,20],[87,16,87,17],[87,18,87,20],[87,22,87,23],[87,24,87,25],[87,26,88,28],[87,29,88,31],[89,24,89,25],[89,26,89,28],[89,29,89,31],[89,32,89,33],[89,34,89,36],[89,37,89,39],[87,45,100,56],[88,16,88,17],[88,18,88,20],[88,22,88,23],[88,24,88,25],[88,32,88,33],[88,34,88,36],[88,37,88,39],[89,16,89,21],[89,22,89,23],[90,34,90,36],[90,37,90,39],[91,16,91,21],[91,22,91,23],[91,24,91,25],[91,26,91,28],[91,29,91,31],[91,32,91,33],[91,34,91,36],[91,37,91,39],[90,16,90,21],[90,22,90,23],[90,24,90,25],[90,26,90,28],[90,29,90,31],[90,32,90,33],[92,34,92,36],[92,37,92,39],[93,16,93,21],[93,22,93,23],[93,24,93,25],[93,26,93,28],[93,29,93,31],[93,32,93,33],[93,34,93,36],[93,37,93,39],[92,16,92,21],[92,22,92,23],[92,24,92,25],[92,26,92,28],[92,29,92,31],[92,32,92,33],[94,34,94,36],[94,37,94,39],[95,16,95,21],[95,22,95,23],[95,24,95,25],[95,26,95,28],[95,29,95,31],[95,32,95,33],[95,34,95,36],[95,37,95,39],[94,16,94,21],[94,22,94,23],[94,24,94,25],[94,26,94,28],[94,29,94,31],[94,32,94,33],[96,34,96,36],[96,37,96,39],[97,16,97,17],[97,18,97,21],[97,22,97,23],[97,24,97,25],[97,26,97,28],[97,29,97,31],[97,32,97,33],[97,34,97,36],[96,16,96,21],[96,22,96,23],[96,24,96,25],[96,26,96,28],[96,29,96,31],[96,32,96,33],[97,37,97,39],[98,16,98,17],[98,18,98,21],[98,22,98,23],[98,24,98,25],[98,26,98,28],[98,29,98,31],[98,32,98,33],[98,34,98,36],[98,37,98,39],[99,32,99,33],[99,34,99,36],[99,37,99,39],[100,16,100,17],[100,18,100,21],[100,22,100,23],[100,24,100,25],[100,26,100,28],[100,29,100,31],[100,32,100,33],[99,16,99,17],[99,18,99,21],[99,22,99,23],[99,24,99,25],[99,26,99,28],[99,29,99,31],[104,45,104,55],[105,45,105,55],[106,16,106,35],[106,36,106,39],[106,45,106,55],[100,34,100,36],[100,37,100,39],[101,21,101,35],[101,36,101,39],[102,45,102,55],[103,45,103,55]]}
[{"$f":"'Contract Info'!A1:G1","v":"SuperManager v3.23 SEKI"},null,null,null,null,null,null,null,null,null,null,null,null,null,null,null,null,null,null,null,null,null,null,null,null,null,null,null,null,null,null,null,null,null,null,null,null,null,null,null,null,null,null,null,null,null,null,null,null,null,null,{"$f":"A1","v":"SuperManager v3.23 SEKI"},null,null,null,null,null,null,null,null,null,null,null,null,null,null,null,null,null,null,null,{"$f":"A1","v":"SuperManager v3.23 SEKI"}]
[null,null,null,null,"Aircraft Daily Detail",null,null,null,null,null,null,null,null,null,null,null,null,null,null,null,"HELICOPTER DAILY USE and COST SUMMARY",null,null,null,null,null,null,null,null,null,null,null,null,null,null,null,null,null,null,null,null,null,null,null,null,null,null,null,null,null,null,null,"OAS-137 ",null,null,"Aircraft Contract Daily Diary",null,null,null,null,null,null,null,null,null,null,null,null,null,null,null,"INTERAGENCY                          HELICOPTER LOAD CALCULATION       Electronic Version 1.0 (3/04)",null,null,null,null,null,null,"MODEL",null,{"$f":"'Contract Info'!D4","v":"Airbus H-125"},null,null,null,null,null,"INTERAGENCY                          HELICOPTER LOAD CALCULATION       Electronic Version 1.0 (3/04)",null,null,null,null,null,null,"MODEL",null,{"$f":"'Contract Info'!D4","v":"Airbus H-125"}]
[]
[]
[null,"Incident:",null,"SEKI Test #2",null,null,null,null,null,null,null,"Date:",null,"2023-05-02",null,null,null,null,null,null,null,"Activity Mission:",null,null,null,null,null,null," Fire",null,null,null,"SAR",null,null,null,"Project",null,null,null,"Training",null,null,null,"    Date:",null,{"$f":"N5","v":"2023-05-02"},null,null,null,null,null,"Contract #",null,{"$f":"'Contract Info'!D6","v":"140D8021D0666"},null,null,"Item:",{"$f":"'Contract Info'!F6","v":0},"Page",1,"OF",1,null,null,"DATE:",null,{"$f":"N5","v":"2023-05-02"},null,null,null,null,null,null,null,null,null,null,"N#",null,{"$f":"'Contract Info'!D3","v":"N836TJ"},null,null,null,null,null,null,null,null,null,null,null,null,"N#",null,{"$f":"'Contract Info'!D3","v":"N836TJ"}]
[null,"Contract #:",null,{"$f":"'Contract Info'!D6","v":"140D8021D0666"},null,null,null,{"$f":"('Contract Info'!F6)*(-1)","v":0},null,null,null,"Contractor:",null,{"$f":"'Contract Info'!$D$8","v":"Butterfly Airways, Inc."},null,null,null,null,null,null,null,null,null,null,null,null,null,null,null,null,null,null,null,null,null,null,null,null,null,null,null,null,null,null,null,null,null,null,null,null,null,null,"1. Contractor:",null,null,{"$f":"'Contract Info'!$D$8","v":"Butterfly Airways, Inc."},null,null,null,"7. Designated Base:",null,null,null,null,{"$f":"'Contract Info'!$D$7","v":"Asher Hill Helibase"}]
[null,null,null,null,null,null,null,null,null,null,null,null,null,null,null,null,"Unavailablty",null,null,null,null,"Helibase:",null,null,null,"Ash Mtn",null,null,null,null,"Incident:",null,null,null,{"$f":"D5","v":"SEKI Test #2"},null,null,null,null,null,null," Agency:",null,null,null,"NPS",null,null,null,null,null,null,"2. A/C Make/Model: ",null,null,{"$f":"'Contract Info'!$D$4","v":"Airbus H-125"},null,null,null,"8. Current Aircraft Location:",null,null,null,null,null,"AMH"]
[null,"Power Check",null,null,null," Resource",null,null,"Qty","Name",null,null,null,null,"Begin","End","Begin ","End",null,null,null,null,null,null,null,null,null,null,null,null,null,null,null,null,null,null,null,null,null,null,null,null,null,null,null,null,null,null,null,null,null,null,"    FAA #:",null,null,{"$f":"'Contract Info'!$D$3","v":"N836TJ"},null,null,null,null,null,null,null,null,null,null,null,null,null,null,null,"PILOT(S)",null,{"$f":"J10","v":"Frank Segovia"},null,null,null,null,"DATE",null,{"$f":"N5","v":"2023-05-02"},null,null,null,null,null,"PILOT(S)",null,{"$f":"BV8","v":"Frank Segovia"},null,null,null,null,"DATE",null,{"$f":"N5","v":"2023-05-02"}]
[null,"Engine#",1,2,null," Aircraft #:",null,null,null,{"$f":"'Contract Info'!$D$3","v":"N836TJ"},null,null,null,null,1200,1800,null,null,null,null,null,"N #:",null,{"$f":"'Contract Info'!$D$3","v":"N836TJ"},null,null,null,"Make/Model:",null,null,null,null,{"$f":"'Contract Info'!$D$4","v":"Airbus H-125"},null,null,null,null,null," Manager's Name:",null,null,null,null,null,"Tyler Maine",null,null,null,null,null,null,null,"3. Pilot(s) On Duty:",null,null,null,null,null,null,"9. Activity:",null,"ferry",null,"Training",null,null,"   Project"]
[null,"Hobbs",111,null,null," Pilot",null,null,1,"Frank Segovia",null,null,null,null,2100,2100,null,null,null,null,null,null,null,null,null,null,null,null,null,null,null,null,null,null,null,null,null,null,null,null,null,null,null,null,null,null,null,null,null,null,null,null,null,{"$f":"J10","v":"Frank Segovia"},null,null,null,null,null,"    Large Fire Support:",null,null,null,"IA",null,null,"SAR"]
[null,"Altitude",7000,null,null," Driver",null,null,null,null,null,null,null,null,null,null,null,null,null,null,null,"Type:",null,{"$f":"'Contract Info'!D5","v":3},null,null,null,null,"CWN",null,null,"X","Exclusive Use",null,null,null,null,null,null,"Other (specify):",null,null,null,null,null,null,null,null,null,null,null,null,"4. Mechanic(s) On Duty:",null,null,null,null,null,null,"10. Other Aircraft On Base",null,null,null,null,null,null,null,null,null,null,null,"MISSION",null,"IA/SAR Preparedness",null,null,null,null,"TIME",null,"0815",null,null,null,null,null,"MISSION",null,null,null,null,null,null,"TIME",null,""]
[null,"O.A.T.",30,null,null,"Mechanic",null,null,1,"Fernando Mechanda",null,null,null,null,1200,2359,null,null,null,null,null,null,null,null,null,null,null,null,null,null,null,null,null,null,null,null,null,null,null,null,null,null,null,null,null,null,null,null,null,null,null,null,null,{"$f":"J12","v":"Fernando Mechanda"},null,null,null,null,null,null,"none"]
[null,"NG",0.94,null,null,"Additionl",null,null,null,null,null,null,null,null,null,null,null,null,null,null,null,"Flight Invoice Reference Number(s):",null,null,null,null,null,null,null,null,null,null,null,null,null,null,null,null,null,null,null,null,null,null,null,null,null,null,null,null,null,null,"5. Driver(s) On Duty:",null,null,null,null,null,null,"11. Weather:"]
[null,"N2",391,null,null," Total Number of Vendor crewmembers",null,null,null,null,null,null,null,null,{"$f":"I10+I11+I12+I13","v":2},null,null,null,null,null,null,null,null,null,null,null,null,null,null,null,"Persons",null,null,"Quantity",null,null,null,null,"Rate",null,null,null,null,null,"Cost",null,null,null,null,null,null,null,null,{"$f":"J11","v":0},null,null,null,null,null,null,"Sunny and getting hotter!!",null,null,null,null,null,null,null,null,null,null,1,"DEPARTURE",null,"AMH",null,null,null,"PA",1650,null,"OAT",35,null,null,null,1,"DEPARTURE",null,null,null,null,null,"PA",null,null,"OAT"]
[null,"E.G.T.",840,null,null," Service Truck Mileage",null,null,null,null,null,null,null,null,20222,20222,null,null,null,null,null,null,null,null,null,null,null,null,null,null,null,null,null,null,null,null,null,null,null,null,null,null,null,null,null,null,null,null,null,null,null,null,"6. Total # Of Contractor Personnel:",null,null,null,null,null,{"$f":"O14","v":2},"12. Local Fuel Price",null,null,null,null,null,"N/A"]
[null,"T4",null,null,null,null,null,null,null,null,null,null,null,null,null,null,null,null,null,null,null,"Revenue Flight Hours:",null,null,null,null,null,null,null,null,null,null,null,{"$f":"J56","v":0},null,null,null,null,1325,null,null,null,null,null,{"$f":"AH16*AM16","v":0},null,null,null,null,null,null,null,"13. Pay Items",null,null,"Begin","End","Total","EXT.","14. SPECIAL EQUIPMENT & STATS",null,null,null,null,null,"HR/DAYS",null,null,"COST"]
[null,"Torque",0.92,null,null,"Allowable Loads:",null,null,null,null,null,null,null,"Delivered",null,"buckets or tanks","gal. per bkt/tank","total",null,null,null,null,null,null,null,null,null,null,null,null,null,null,null,null,null,null,null,null,null,null,null,null,null,null,null,null,null,null,null,null,null,null,null,null,null,null,null,null,null,null,null,null,null,null,null,null,null,null,null,null,null,2,"DESTINATION",null,"IA/SAR",null,null,null,"PA",7000,null,"OAT",25,null,null,null,2,"DESTINATION",null,null,null,null,null,"PA",null,null,"OAT"]
[null,"Perform",16.399999999999999,6.3,null,"PA (feet)",null,{"$f":"CB17","v":7000},null,{"$f":"CQ17","v":0},null,null,null,null,null,null,null,null,null,null,null,"*Availabiliy (Hours or Day)",null,null,null,null,null,null,null,null,null,null,null,1,null,null,null,null,3695,null,null,null,null,null,{"$f":"IF(AH18>1,(AH18*AM18/14),(AH18*AM18))","v":3695},null,null,null,null,null,null,null,"Availability",null,null,{"$f":"O9","v":1200},{"$f":"P9","v":1800},{"$f":"(BE18-BD18)/100","v":6},null,"Wilderness Flight Time",null,null,null,null,null,5]
[null,"Chart",0,{"$f":"C19","v":0},null,"ºC",null,{"$f":"CE17","v":25},null,{"$f":"CT17","v":0},null,null,null,"Water ",null,{"$f":"M56","v":0},180,{"$f":"Q19*P19","v":0}]
[null,"Margin",{"$f":"C18-C19","v":16.399999999999999},{"$f":"D18-D19","v":6.3},null,"# fuel",null,{"$f":"CA26","v":499.80000000000007},null,{"$f":"CP26","v":""},null,null,null,"Retardant",null,{"$f":"N56","v":0},null,{"$f":"Q20*P20","v":0},null,null,null,"Pilot Extended Standby",null,null,null,null,null,null,null,null,{"$f":"I10","v":1},null,null,{"$f":"IF(BF24<'Contract Info'!$D$23,\"0\",BF24-('Contract Info'!$D$23))","v":"0"},null,null,null,null,52,null,null,null,null,null,{"$f":"AH20*AE20*AM20","v":0},null,null,null,null,null,null,null,"Flight Time",null,null,{"$f":"F29","v":113.7},{"$f":"H56","v":113.7},{"$f":"J56","v":0},null,"Wilderness Landings",null,null,null,null,null,4,null,null,null,null,null,3,"HELICOPTER EQUIPPED WEIGHT",null,null,null,null,null,3268,null,null,null,null,null,null,null,3,"HELICOPTER EQUIPPED WEIGHT"]
[null,"Next Due",{"$f":"C10+10","v":121},null,null,"HIGE",null,{"$f":"BY55","v":1277.1999999999998},null,{"$f":"CN55","v":""},null,null,null,"Foam",null,{"$f":"O56","v":0},null,{"$f":"Q21*P21","v":0}]
[null,null,null,null,null,"HOGE",null,{"$f":"CA55","v":1277.1999999999998},null,{"$f":"CP55","v":""},null,null,null,null,null,null,null,null,null,null,null,"Driver Extended Standby",null,null,null,null,null,null,null,null,{"$f":"I11","v":0},null,null,{"$f":"IF(BF26<'Contract Info'!$D$23,\"0\",BF26-('Contract Info'!$D$23))","v":"0"},null,null,null,null,39,null,null,null,null,null,{"$f":"AH22*AE22*AM22","v":0},null,null,null,null,null,null,null,"Service Miles",null,null,{"$f":"O15","v":20222},{"$f":"P15","v":20222},{"$f":"BE22-BD22","v":0},null,"Wilderness Ext. Load Deliveries or Pickups (non-s-h)",null,null,null,null,null,3]
[null,null,null,null,null,"HOGE-J",null,{"$f":"CD55","v":1452.1999999999998},null,{"$f":"CS55","v":""},null,null,null,null,null,null,null,null,null,null,null,null,null,null,null,null,null,null,null,null,null,null,null,null,null,null,null,null,null,null,null,null,null,null,null,null,null,null,null,null,null,null,null,null,null,null,null,null,null,null,null,null,null,null,null,null,null,null,null,null,null,4,"FLIGHT CREW WEIGHT",null,null,null,null,null,180,null,null,null,null,null,null,null,4,"FLIGHT CREW WEIGHT"]
[null,null,null,null,null,null,null,null,null,null,null,null,null,null,null,null,null,null,null,null,null,"Mechanic Extend Standby",null,null,null,null,null,null,null,null,{"$f":"I12","v":1},null,null,{"$f":"IF(BF28<'Contract Info'!$D$23,\"0\",BF28-('Contract Info'!$D$23))","v":2.59},null,null,null,null,59.59,null,null,null,null,null,{"$f":"AH24*AE24*AM24","v":154.3381},null,null,null,null,null,null,null,"Pilot Duty",null,null,{"$f":"O10","v":2100},{"$f":"P10","v":2100},{"$f":"(BE24-BD24)/100","v":0},{"$f":"IF(BF24<'Contract Info'!$D$23,0,BF24-('Contract Info'!$D$23))","v":0},"Wilderness Short-hauls",null,null,null,null,null,2]
[null,"Flight Log"]
[null,null,null,"Depart","Arrive",null,null,null,null,null,null,null," ",null,"Short-",null,null,"Flight","Non-",null,null,"Per Diem or RON",null,null,null,null,null,null,null,null,{"$f":"O14","v":2},null,null,null,null,null,null,null,169,null,null,null,null,null,{"$f":"AE26*AM26","v":338},null,null,null,null,null,null,null,"Driver Duty",null,null,{"$f":"O11","v":0},{"$f":"P11","v":0},{"$f":"(BE26-BD26)/100","v":0},{"$f":"IF(BF26<'Contract Info'!$D$23,0,BF26-('Contract Info'!$D$23))","v":0},"Initial Attacks",null,null,null,null,null,1,null,null,null,null,null,5,"FUEL WEIGHT",null,71.400000000000006,"gals   X",7,"lbs/gal",{"$f":"IF(BY26=\"\",\"\",SUM(BW26*BY26))","v":499.80000000000007},null,null,null,null,null,null,null,5,"FUEL WEIGHT",null,null,"gals   X",null,"lbs/gal",{"$f":"IF(CN26=\"\",\"\",SUM(CL26*CN26))","v":""}]
[null,"Depart","Destin","Clock","Clock","Depart",null,"Arrive",null,"Hobbs",null,"Lbs","H2O","Sling","Haul",null,"Use","Time","Revnue"]
[null,"From","To","Time","Time","Hobbs",null,"Hobbs",null,"Total","PAX","Cargo","Buckts","Loads","Evols","Acct","Code","Cost","flight?",null,null,"Service Truck Miles",null,null,null,null,null,null,null,null,null,null,null,{"$f":"P15-O15","v":0},null,null,null,null,2.4500000000000002,null,null,null,null,null,{"$f":"AH28*AM28","v":0},null,null,null,null,null,null,null,"Mechanic Duty",null,null,{"$f":"O12","v":1200},{"$f":"P12","v":2359},{"$f":"(BE28-BD28)/100","v":11.59},{"$f":"IF(BF28<'Contract Info'!$D$23,\"0\",BF28-('Contract Info'!$D$23))","v":2.59}]
[null,null,null,null,null,113.7,null,null,null,{"$f":"IF(H29=\"\",\"\",IF(S29=\"\",H29-F29,\"\"))","v":""},null,null,null,null,null,null,null,{"$f":"IF(J29=\"\",\"\",J29*('Contract Info'!$D$18))","v":""},null,null,null,null,null,null,null,null,null,null,null,null,null,null,null,null,null,null,null,null,null,null,null,null,null,null,null,null,null,null,null,null,null,null,null,null,null,null,null,null,null,null,null,null,null,null,null,null,null,null,null,null,null,6,"OPERATING WEIGHT  (3 + 4 + 5)",null,null,null,null,null,{"$f":"IF(CA26=\"\",\"\",SUM(CA20:CG28))","v":3947.8},null,null,null,null,null,null,null,6,"OPERATING WEIGHT  (3 + 4 + 5)",null,null,null,null,null,{"$f":"IF(CP26=\"\",\"\",SUM(CP20:CV28))","v":""}]
[null,null,null,null,null,{"$f":"IF(H29=\"\",\"\",H29)","v":""},null,null,null,{"$f":"IF(H30=\"\",\"\",IF(S30=\"\",H30-F30,\"\"))","v":""},null,null,null,null,null,null,null,{"$f":"IF(J30=\"\",\"\",J30*('Contract Info'!$D$18))","v":""},null,null,null,"Addnl Crew Extend Stnby:",null,null,null,null,null,null,null,null,{"$f":"I13","v":0},null,null,null,null,null,null,null,10,null,null,null,null,null,{"$f":"AH30*AE30*AM30","v":0},null,null,null,null,null,null,null,"15. Aircraft Status: (Maintenance performed, power trend analysis completed, reasons for any unavailability, etc.)"]
[null,null,null,null,null,{"$f":"IF(H30=\"\",\"\",H30)","v":""},null,null,null,{"$f":"IF(H31=\"\",\"\",IF(S31=\"\",H31-F31,\"\"))","v":""},null,null,null,null,null,null,null,{"$f":"IF(J31=\"\",\"\",J31*('Contract Info'!$D$18))","v":""},null,null,null,null,null,null,null,null,null,null,null,null,null,null,null,null,null,null,null,null,null,null,null,null,null,null,null,null,null,null,null,null,null,null,"Pre-flight maintenance performed. "]
[null,null,null,null,null,{"$f":"IF(H31=\"\",\"\",H31)","v":""},null,null,null,"",null,null,null,null,null,null,null,{"$f":"IF(J32=\"\",\"\",J32*('Contract Info'!$D$18))","v":""},null,null,null,"Add'l Cost:",null,null,null,null,null,null,null,null,null,null,null,null,null,null,null,null,null,null,null,null,null,null,{"$f":"AH32*AE32*AM32","v":0},null,null,null,null,null,null,null,null,null,null,null,null,null,null,null,null,null,null,null,null,null,null,null,null,null,null,null," ",null,null,null,"Non-Jettisonable",null,null,null,null,"Jettisonable",null,null,null,null,null," ",null,null,null,"Non-Jettisonable",null,null,null,null,"Jettisonable"]
[null,null,null,null,null,"",null,null,null,"",null,null,null,null,null,null,null,{"$f":"IF(J33=\"\",\"\",J33*('Contract Info'!$D$18))","v":""},null,null,null,null,null,null,null,null,null,null,null,null,null,null,null,null,null,null,null,null,null,null,null,null,null,null,null,null,null,null,null,null,null,null,null,null,null,null,null,null,null,null,null,null,null,null,null,null,null,null,null,null,null,null," ",null,null,null,"HIGE",null,"HOGE",null,null,"HOGE- J",null,null,null,null,null," ",null,null,null,"HIGE",null,"HOGE",null,null,"HOGE- J"]
[null,null,null,null,null,"",null,null,null,"",null,null,null,null,null,null,null,{"$f":"IF(J34=\"\",\"\",J34*('Contract Info'!$D$18))","v":""},null,null,null,"Add'l Cost:",null,null,null,null,null,null,null,null,null,null,null,null,null,null,null,null,null,null,null,null,null,null,{"$f":"AH34*AE34*AM34","v":0},null,null,null,null,null,null,null,null,null,null,null,null,null,null,null,null,null,null,null,null,null,null,null,null,null,null,"7a","PERFORMANCE REFERENCE    (List chart/supplement from Flight Manual)",null,null,null,"BLR Fig 1 or 2",null,"BLR Fig 1 or 2",null,null,"BLR Fig 1 or 2",null,null,null,null,"7a","PERFORMANCE REFERENCE    (List chart/supplement from Flight Manual)"]
[null,null,null,null,null,"",null,null,null,"",null,null,null,null,null,null,null,{"$f":"IF(J35=\"\",\"\",J35*('Contract Info'!$D$18))","v":""}]
[null,null,null,null,null,"",null,null,null,"",null,null,null,null,null,null,null,{"$f":"IF(J36=\"\",\"\",J36*('Contract Info'!$D$18))","v":""},null,null,null,"Add'l Cost:",null,null,null,null,null,null,null,null,null,null,null,null,null,null,null,null,null,null,null,null,null,null,{"$f":"AH36*AE36*AM36","v":0},null,null,null,null,null,null,null,"16. Narrative Report: (Include problems encountered, official visits or inspections, SAFECOMs submitted, etc.)"]
[null,null,null,null,null,"",null,null,null,"",null,null,null,null,null,null,null,{"$f":"IF(J37=\"\",\"\",J37*('Contract Info'!$D$18))","v":""},null,null,null,null,null,null,null,null,null,null,null,null,null,null,null,null,null,null,null,null,null,null,null,null,null,null,null,null,null,null,null,null,null,null,"Update helicopter and contract info on May 18th to be ready for the EU start date of May 19th.",null,null,null,null,null,null,null,null,null,null,null,null,null,null,null,null,null,null,"7b","COMPUTED GROSS WEIGHT  (From Flight Manual Performance Section)",null,null,null,5400,null,5400,null,null,5400,null,null,null,null,"7b","COMPUTED GROSS WEIGHT  (From Flight Manual Performance Section)"]
[null,null,null,null,null,"",null,null,null,"",null,null,null,null,null,null,null,{"$f":"IF(J38=\"\",\"\",J38*('Contract Info'!$D$18))","v":""},null,null,null,"* Do not calculate for exclusive  use contracts where",null,null,null,null,null,null,null,null,null,null,null,null,"Daily Grand Total Cost:",null,null,null,null,null,null,null,null,null,{"$f":"AS16+AS18+AS20+AS22+AS24+AS26+AS28+AS30+AS32+AS34+AS36","v":4187.3380999999999}]
[null,null,null,null,null,"",null,null,null,"",null,null,null,null,null,null,null,{"$f":"IF(J39=\"\",\"\",J39*('Contract Info'!$D$18))","v":""},null,null,null,null,"availability is paid from presuppression funds"]
[null,null,null,null,null,"",null,null,null,"",null,null,null,null,null,null,null,{"$f":"IF(J40=\"\",\"\",J40*('Contract Info'!$D$18))","v":""},null,null,null,null,null,null,null,null,null,null,null,null,null,null,null,null,null,null,null,null,null,null,null,null,null,null,null,null,null,null,null,null,null,null,null,null,null,null,null,null,null,null,null,null,null,null,null,null,null,null,null,null,null,8,"WEIGHT REDUCTION                (Required for all Non-Jettisonable loads)",null,null,null,175,null,175,null,null,0,null,null,null,null,8,"WEIGHT REDUCTION                (Required for all Non-Jettisonable loads)"]
[null,null,null,null,null,"",null,null,null,"",null,null,null,null,null,null,null,{"$f":"IF(J41=\"\",\"\",J41*('Contract Info'!$D$18))","v":""},null,null,null,"Total PAX Transported",null,null,null,null,"Total Pounds Cargo",null,null,null,null,null,"Total Gallons Water",null,null,null,null,null,"Sling Loads",null,null,null,null,null,"Short-haul Evolutions"]
[null,null,null,null,null,"",null,null,null,"",null,null,null,null,null,null,null,{"$f":"IF(J42=\"\",\"\",J42*('Contract Info'!$D$18))","v":""}]
[null,null,null,null,null,"",null,null,null,"",null,null,null,null,null,null,null,{"$f":"IF(J43=\"\",\"\",J43*('Contract Info'!$D$18))","v":""},null,null,null,{"$f":"K166","v":0},null,null,null,null,{"$f":"L166","v":0},null,null,null,null,null,{"$f":"Q19*M166","v":0},null,null,null,null,null,{"$f":"N56","v":0},null,null,null,null,null,{"$f":"O56","v":0},null,null,null,null,null,null,null,null,null,null,null,null,null,null,null,null,null,null,null,null,null,null,null,null,null,null,9,"ADJUSTED WEIGHT                    (7b minus 8)",null,null,null,{"$f":"IF(BY37=\"\",\"\",SUM(BY37-BY40))","v":5225},null,{"$f":"IF(CA37=\"\",\"\",SUM(CA37-CA40))","v":5225},null,null,{"$f":"IF(CD37=\"\",\"\",SUM(CD37-CD40))","v":5400},null,null,null,null,9,"ADJUSTED WEIGHT                    (7b minus 8)",null,null,null,{"$f":"IF(CN37=\"\",\"\",SUM(CN37-CN40))","v":""},null,{"$f":"IF(CP37=\"\",\"\",SUM(CP37-CP40))","v":""},null,null,{"$f":"IF(CS37=\"\",\"\",SUM(CS37-CS40))","v":""}]
[null,null,null,null,null,"",null,null,null,"",null,null,null,null,null,null,null,{"$f":"IF(J44=\"\",\"\",J44*('Contract Info'!$D$18))","v":""}]
[null,null,null,null,null,"",null,null,null,"",null,null,null,null,null,null,null,{"$f":"IF(J45=\"\",\"\",J45*('Contract Info'!$D$18))","v":""},null,null,null,null,null,null,null,null,null,null,null,null,null,null,"Aerial Ignition"]
[null,null,null,null,null,"",null,null,null,"",null,null,null,null,null,null,null,{"$f":"IF(J46=\"\",\"\",J46*('Contract Info'!$D$18))","v":""},null,null,null,"Acres Treated",null,null,null,null,null,null,null,null,"PSD Spheres Used",null,null,null,null,null,null,null,null,null,"UAS Spheres Used",null,null,null,null,null,null,null,null,null,null,null,null,null,null,null,null,null,null,null,null,null,null,null,null,null,null,null,null,null,null,10,"GROSS WEIGHT LIMITATION    (From Flight Manual Limitations Section)",null,null,null,5225,null,5225,null,null,6173,null,null,null,null,10,"GROSS WEIGHT LIMITATION    (From Flight Manual Limitations Section)"]
[null,null,null,null,null,"",null,null,null,"",null,null,null,null,null,null,null,{"$f":"IF(J47=\"\",\"\",J47*('Contract Info'!$D$18))","v":""},null,null,null,0,null,null,null,null,null,null,null,null,"0",null,null,null,null,null,null,null,null,null,0]
[null,null,null,null,null,"",null,null,null,"",null,null,null,null,null,null,null,{"$f":"IF(J48=\"\",\"\",J48*('Contract Info'!$D$18))","v":""}]
[null,null,null,null,null,"",null,null,null,"",null,null,null,null,null,null,null,{"$f":"IF(J49=\"\",\"\",J49*('Contract Info'!$D$18))","v":""},null,null,null,null,null,null,null,null,null,null,null,null,null,null,null,null,null,null,null,null,null,null,null,null,null,null,null,null,null,null,null,null,null,null,null,null,null,null,null,null,null,null,null,null,null,null,null,null,null,null,null,null,null,11,"SELECTED WEIGHT                  (Lowest of 9 of 10)",null,null,null,{"$f":"IF(BY46=\"\",\"\",MIN(BY46,BY43))","v":5225},null,{"$f":"IF(CA46=\"\",\"\",MIN(CA46,CA43))","v":5225},null,null,{"$f":"IF(CD46=\"\",\"\",MIN(CD46,CD43))","v":5400},null,null,null,null,11,"SELECTED WEIGHT                  (Lowest of 9 of 10)",null,null,null,{"$f":"IF(CN46=\"\",\"\",MIN(CN46,CN43))","v":""},null,{"$f":"IF(CP46=\"\",\"\",MIN(CP46,CP43))","v":""},null,null,{"$f":"IF(CS46=\"\",\"\",MIN(CS46,CS43))","v":""}]
[null,null,null,null,null,"",null,null,null,"",null,null,null,null,null,null,null,{"$f":"IF(J50=\"\",\"\",J50*('Contract Info'!$D$18))","v":""},null,null,null,"Account Name",null,null,null,null,null,null,null,null,"Account Code",null,null,null,null,null,null,null,null,null,"Cost"]
[null,null,null,null,null,"",null,null,null,"",null,null,null,null,null,null,null,{"$f":"IF(J51=\"\",\"\",J51*('Contract Info'!$D$18))","v":""},null,null,null,"Daily Availability",null,null,null,null,null,null,null,null,"PF.FPAMD1022.00.1",null,null,null,null,null,null,null,null,null,{"$f":"SUM(AS18)","v":3695}]
[null,null,null,null,null,"",null,null,null,"",null,null,null,null,null,null,null,{"$f":"IF(J52=\"\",\"\",J52*('Contract Info'!$D$18))","v":""},null,null,null,null,null,null,null,null,null,null,null,null,null,null,null,null,null,null,null,null,null,null,null,null,null,null,null,null,null,null,null,null,null,null,"17. Miscellaneous Costs: (Contractor purchased permits, fees, travel, etc; to be reimbursed by Govt.)",null,null,null,null,null,null,null,null,null,null,null,null,null,null,null,null,null,null,12,"OPERATING WEIGHT                    (From Line 6)",null,null,null,{"$f":"IF(CA29=\"\",\"\",SUM(CA29))","v":3947.8},null,{"$f":"IF(CA29=\"\",\"\",SUM(CA29))","v":3947.8},null,null,{"$f":"IF(CA29=\"\",\"\",SUM(CA29))","v":3947.8},null,null,null,null,12,"OPERATING WEIGHT                    (From Line 6)",null,null,null,{"$f":"IF(CP29=\"\",\"\",SUM(CP29))","v":""},null,{"$f":"IF(CP29=\"\",\"\",SUM(CP29))","v":""},null,null,{"$f":"IF(CP29=\"\",\"\",SUM(CP29))","v":""}]
[null,null,null,null,null,"",null,null,null,"",null,null,null,null,null,null,null,{"$f":"IF(J53=\"\",\"\",J53*('Contract Info'!$D$18))","v":""}]
[null,null,null,null,null,"",null,null,null,"",null,null,null,null,null,null,null,{"$f":"IF(J54=\"\",\"\",J54*('Contract Info'!$D$18))","v":""}]
[null,null,null,null,null,"",null,null,null,"",null,null,null,null,null,null,null,{"$f":"IF(J55=\"\",\"\",J55*('Contract Info'!$D$18))","v":""},null,null,null,null,null,null,null,null,null,null,null,null,null,null,null,null,null,null,null,null,null,null,null,null,null,null,null,null,null,null,null,null,null,null,null,null,null,null,null,null,null,null,null,null,null,null,null,null,null,null,null,null,null,13,"ALLOWABLE PAYLOAD                  (11 minus 12)",null,null,null,{"$f":"IF(BY46=\"\",\"\",SUM(BY49-BY52))","v":1277.1999999999998},null,{"$f":"IF(CA46=\"\",\"\",SUM(CA49-CA52))","v":1277.1999999999998},null,null,{"$f":"IF(CD46=\"\",\"\",SUM(CD49-CD52))","v":1452.1999999999998},null,null,null,null,13,"ALLOWABLE PAYLOAD                  (11 minus 12)",null,null,null,{"$f":"IF(CN46=\"\",\"\",SUM(CN49-CN52))","v":""},null,{"$f":"IF(CP46=\"\",\"\",SUM(CP49-CP52))","v":""},null,null,{"$f":"IF(CS46=\"\",\"\",SUM(CS49-CS52))","v":""}]
[null,"TOTALS",null,null,null,{"$f":"F29","v":113.7},null,{"$f":"IF(H29=\"\",F29,LARGE(H29:H55,1))","v":113.7},null,{"$f":"SUM(J29:J55)","v":0},0,0,{"$f":"SUM(M29:M55)","v":0},0,0,null,null,{"$f":"SUM(R29:R55)","v":0},null,null,null,null,null,null,null,null,null,null,null,null,null,null,null,null,null,null,null,null,null,null,null,null,null,null,null,null,null,null,null,null,null,null,"18. Govt. Representative Name/Title (Print):",null,null,null,null,null," Govt. Representative Signature:",null,null,null,null,null,null,null,null,"Date:"]
[null,"Depart","Destin","Depart","Arrive","Depart",null,"Arrive",null,"Hobbs","PAX","Lbs","H2O","Sling","Short-","Acct","Use","Flight","Non-",null,null,null,null,null,null,null,null,null,null,null,"Grand Total for Daily Helicopter Cost =",null,null,null,null,null,null,null,null,null,{"$f":"SUM(AO51:AX56)","v":3695},null,null,null,null,null,null,null,null,null,null,null,{"$f":"AS9","v":"Tyler Maine"},null,null,null,null,null,null,null,null,null,null,null,null,null,null,{"$f":"N5","v":"2023-05-02"}]
[null,"From","To","Clock","Clock","Hobbs",null,"Hobbs",null,"Total",null,"Cargo","Buckts","Loads","Haul",null,"Code","Time","Revnue",null,null,null,null,null,null,null,null,null,null,null,null,null,null,null,null,null,null,null,null,null,null,null,null,null,null,null,null,null,null,null,null,null,null,null,null,null,null,null,null,null,null,null,null,null,null,null,null,null,null,null,null,null,"Exceeds = Allowable Exceeded",null,null,null,{"$f":"IF(CD68=\"\",\"\",IF(CD68>BY55,\"Exceeds\",\"OK\"))","v":""},null,{"$f":"IF(CD68=\"\",\"\",IF(CD68>CA55,\"Exceeds\",\"OK\"))","v":""},null,null,{"$f":"IF(CD68=\"\",\"\",IF(CD68>CD55,\"Exceeds\",\"OK\"))","v":""},null,null,null,null,null,"Exceeds = Allowable Exceeded",null,null,null,{"$f":"IF(CS68=\"\",\"\",IF(CS68>CN55,\"Exceeds\",\"OK\"))","v":""},null,{"$f":"IF(CS68=\"\",\"\",IF(CS68>CP55,\"Exceeds\",\"OK\"))","v":""},null,null,{"$f":"IF(CS68=\"\",\"\",IF(CS68>CS55,\"Exceeds\",\"OK\"))","v":""}]
[null,null,null,"Time","Time",null,null,null,null,null,null,null,null,null,"Evols",null,null,"Cost","flight?",null,null,"*For full availability enter 1, otherwise enter 14 minus # of hours unavailable",null,null,null,null,null,null,null,null,null,null,null,null,null,null,{"$f":"A1","v":"SuperManager v3.23 SEKI"},null,null,null,null,null,null,null,"HCM-15 (REQUIRED)",null,null,null,null,null,null,null,null,null,null,"             NFES #1088",null,null,{"$f":"A1","v":"SuperManager v3.23 SEKI"},null,null,null,null,null,null,null,"HCM-1 (REQUIRED)"]
[null,null,null,null,null,null,null,null,null,null,null,null,null,null,null,{"$f":"A1","v":"SuperManager v3.23 SEKI"},null,null,null,null,null,null,null,null,null,null,null,null,null,null,null,null,null,null,null,null,null,null,null,null,null,null,null,null,null,null,null,null,null,null,null,null,null,null,null,null,null,null,null,null,null,null,null,null,null,null,null,null,null,null,null,14,"PASSENGERS/CARGO",null,null,null,null,null,null,null,null,null,null,null,null,null,14,"PASSENGERS/CARGO"]
[]
[]
[]
[]
[]
[null,null,null,null,null,null,null,null,null,null,null,null,null,null,null,null,null,null,"Aviation Personnel Daily Cost Summary"]
[]
[null,null,null,null,null,null,null,null,null,null,null,null,null,null,null,null,null,null,null,null,null,null,null,null,null,null,null,null,null,null,null,null,null,null,null,null,null,null,null,null,null,null,null,null,null,null,null,null,null,null,null,null,null,null,null,null,null,null,null,null,null,null,null,null,null,null,null,null,null,null,null,15,"ACTUAL PAYLOAD  (Total of all weights listed in Item 14)                                                               Line 15 must not exceed Line 13 for the intended mission (HIGE, HOGE or HOGE-J)",null,null,null,null,null,null,null,null,{"$f":"IF(CD60+CD62+CD64+CD66=0,\"\",SUM(CD60:CG67))","v":""},null,null,null,null,15,"ACTUAL PAYLOAD  (Total of all weights listed in Item 14)                                                               Line 15 must not exceed Line 13 for the intended mission (HIGE, HOGE or HOGE-J)",null,null,null,null,null,null,null,null,{"$f":"IF(CS60+CS62+CS64+CS66=0,\"\",SUM(CS60:CV67))","v":""}]
[null,null,null,null,null,null,null,null,null,null,null,null,null,null,null,null,"Crew Name:",null,"SEKI Helitack",null,null,null,null,null,null,null,null,null,"Date:",null,{"$f":"N5","v":"2023-05-02"},null,null,null,null,"  Incident/Project:",null,null,null,null,null,{"$f":"AI7","v":"SEKI Test #2"},null,null,null,null,null,null,null,null,"Account:",null,null,"PF.FPAMD1022.00.1"]
[]
[null,null,null,null,null,null,null,null,null,null,null,null,null,null,null,null,null,null,null,null,null,null,"Pay",null,"Regular TIme (RT)",null,null,null,null,null,null,null,null,null,null,null,"Overtime (OT)",null,null,null,null,null,null,null,null,null,null,null,"Hazard (Haz)",null,null,null,null,"Travel (Trv)",null,null,null,null,null,null,null,null,null,null,null,null,null,null,null,null,null,"PILOT SIGNATURE",null,null," ",null,null,null,null,null,null,"HazMat Onboard",null,null,null,null,"PILOT SIGNATURE",null,null," ",null,null,null,null,null,null,"HazMat Onboard"]
[null,"Name",null,"Lieu Days",null,"Quals",null,null,null,null,null,null,null,null,null,null,"Name",null,"Position",null,null,null,"Grade",null,"Begin",null,"End",null,"Break",null,"Hours",null,"Rate",null,"Cost",null,"Begin",null,"End",null,"Break",null,"Hours",null,"Rate",null,"Cost",null,"Hours",null,"Prmum",null,"Pay","Lodge","M&IE","Other","Total"]
[null,{"$f":"Q73","v":"Tyler Wayne"},null,"Thurs/Fri",null,"HEBM, HMGB, ICT4, SHLS, FAL2, PLDO, FIRB",null,null,null,null,null,null,null,null,null,null,"Tyler Wayne",null,"Assistant Manager",null,null,null,"GS-8/4",null,"08:00:00",null,"16:30:00",null,"00:30:00",null,{"$f":"IF(AA73-Y73=0,\"\",AA73-Y73-AC73)","v":"08:00:00"},null,26.11,null,{"$f":"IF(AG73=\"\",\"\",IF(AE73=\"\",\"\",AE73*AG73*24))","v":208.88000000000005},null,"07:00:00",null,"17:00:00",null,null,null,{"$f":"IF(AM73-AK73=0,\"\",AM73-AK73-AO73)","v":"10:00:00"},null,{"$f":"IF(AG73*1.5=0,\"\",IF(AG73*1.5>'Contract Info'!$D$38,'Contract Info'!$D$38,AG73*1.5))","v":39.164999999999999},null,{"$f":"IF(AS73=\"\",\"\",IF(AQ73=\"\",\"\",AQ73*AS73*24))","v":391.65000000000003},null,"09:00:00",null,0.25,null,{"$f":"IF(AG73*AW73=0,\"\",PRODUCT(AG73,$AY73,AW73,24))","v":58.747500000000002},null,null,null,{"$f":"SUM(BB73:BD73)","v":0},null,null,null,null,null,null,null,null,null,null,null,null,null,null,"MANAGER SIGNATURE",null,null," ",null,null,null,null,null,null,"YES","X","NO",null,null,"MANAGER SIGNATURE",null,null," ",null,null,null,null,null,null,"YES",null,"NO"]
[null,"PJ Nutall",null,"Sun/Mon",null,"HEBM(t), HMGB, ICT4, SHLS, FAL3, PLDO, FIRB",null,null,null,null,null,null,null,null,null,null,"PJ Nutall",null,"Lead Crew","Asst. Manager",null,null,"GS-7/8",null,"08:00:00",null,"16:30:00",null,"00:30:00",null,{"$f":"IF(AA74-Y74=0,\"\",AA74-Y74-AC74)","v":"08:00:00"},null,26.44,null,{"$f":"IF(AG74=\"\",\"\",IF(AE74=\"\",\"\",AE74*AG74*24))","v":211.52000000000004},null,null,null,null,null,null,null,{"$f":"IF(AM74-AK74=0,\"\",AM74-AK74-AO74)","v":""},null,{"$f":"IF(AG74*1.5=0,\"\",IF(AG74*1.5>'Contract Info'!$D$38,'Contract Info'!$D$38,AG74*1.5))","v":39.660000000000004},null,{"$f":"IF(AS74=\"\",\"\",IF(AQ74=\"\",\"\",AQ74*AS74*24))","v":""},null,null,null,0.25,null,{"$f":"IF(AG74*AW74=0,\"\",PRODUCT(AG74,$AY74,AW74,24))","v":""},null,null,null,{"$f":"SUM(BB74:BD74)","v":0}]
[null,"Melissa McBurger",null,"Wed/Thurs",null,"HEBM, HMGB, ICT4(t), SHLR, AEMF, PLDO, FIRB",null,null,null,null,null,null,null,null,null,null,"Melissa McBurger",null,"Lead Crew","Manager Trainee",null,null,"GS-6/6",null,"08:00:00",null,"16:30:00",null,"00:30:00",null,"08:00:00",null,22.51,null,180.08000000000004,null,null,null,null,null,null,null,"",null,{"$f":"IF(AG75*1.5=0,\"\",IF(AG75*1.5>'Contract Info'!$D$38,'Contract Info'!$D$38,AG75*1.5))","v":33.765000000000001},null,"",null,null,null,0.25,null,"",null,null,null,0,null,null,null,null,null,null,null,null,null,null,null,null,null,null,null,null,null,null,null,null,null,{"$f":"A1","v":"SuperManager v3.23 SEKI"},null,null,null,null,null,"HCM-8 ",null,null,null,null,null,null,null,null,{"$f":"A1","v":"SuperManager v3.23 SEKI"},null,null,null,null,null,"HCM-8 "]
[null,"Damian Lorna",null,"Sat/Sun",null,"HMGB, ICT4(t), SHLS, FAL2, PLDO(t)",null,null,null,null,null,null,null,null,null,null,"Damian Lorna",null,"Sr. Crewmember","Manager Trainee",null,null,"GS-5",null,"08:00:00",null,"16:30:00",null,"00:30:00",null,"08:00:00",null,17.309999999999999,null,138.48000000000002,null,null,null,null,null,null,null,"",null,{"$f":"IF(AG76*1.5=0,\"\",IF(AG76*1.5>'Contract Info'!$D$38,'Contract Info'!$D$38,AG76*1.5))","v":25.964999999999996},null,"",null,null,null,0.25,null,"",null,null,null,0]
[null,"Erik Anders",null,"Fri/Sat",null,"HECM, FFT1(t), SHLR, FAL3, EMTF, ABRO(t)",null,null,null,null,null,null,null,null,null,null,"Erik Anders",null,"Crewmember","Manager Trainee",null,null,"GS-4",null,"08:00:00",null,"16:30:00",null,"00:30:00",null,"08:00:00",null,15.92,null,127.36000000000001,null,null,null,null,null,null,null,"",null,{"$f":"IF(AG77*1.5=0,\"\",IF(AG77*1.5>'Contract Info'!$D$38,'Contract Info'!$D$38,AG77*1.5))","v":23.88},null,"",null,null,null,0.25,null,"",null,null,null,0]
[null,"Chandra Homer",null,"Mon/Tues",null,"HECM(t), FFT1(t), EMTF",null,null,null,null,null,null,null,null,null,null,"Chandra Homer",null,"Crewmember","Manager Trainee",null,null,"GS-4",null,"08:00:00",null,"16:30:00",null,"00:30:00",null,"08:00:00",null,15.92,null,127.36000000000001,null,null,null,null,null,null,null,"",null,{"$f":"IF(AG78*1.5=0,\"\",IF(AG78*1.5>'Contract Info'!$D$38,'Contract Info'!$D$38,AG78*1.5))","v":23.88},null,"",null,null,null,0.25,null,"",null,null,null,0]
[null,"Larry Goodbush",null,"Tues/Wed",null,"HECM(t), FFT1(t)",null,null,null,null,null,null,null,null,null,null,"Larry Goodbush",null,"Crewmember","Manager Trainee",null,null,"GS-4",null,"08:00:00",null,"16:30:00",null,"00:30:00",null,"08:00:00",null,15.92,null,127.36000000000001,null,null,null,null,null,null,null,"",null,{"$f":"IF(AG79*1.5=0,\"\",IF(AG79*1.5>'Contract Info'!$D$38,'Contract Info'!$D$38,AG79*1.5))","v":23.88},null,"",null,null,null,0.25,null,"",null,null,null,0]
[null,0,null,null,null,null,null,null,null,null,null,null,null,null,null,null,null,null,null,"Crewmember",null,null,null,null,null,null,null,null,null,null,"",null,null,null,"",null,null,null,null,null,null,null,"",null,{"$f":"IF(AG80*1.5=0,\"\",IF(AG80*1.5>'Contract Info'!$D$38,'Contract Info'!$D$38,AG80*1.5))","v":""},null,"",null,null,null,0.25,null,"",null,null,null,0]
[null,0,null,null,null,null,null,null,null,null,null,null,null,null,null,null,null,null,null,"Crewmember",null,null,null,null,null,null,null,null,null,null,"",null,null,null,"",null,null,null,null,null,null,null,"",null,{"$f":"IF(AG81*1.5=0,\"\",IF(AG81*1.5>'Contract Info'!$D$38,'Contract Info'!$D$38,AG81*1.5))","v":""},null,"",null,null,null,0.25,null,"",null,null,null,0]
[null,0,null,null,null,null,null,null,null,null,null,null,null,null,null,null,null,null,null,"Crewmember",null,null,null,null,null,null,null,null,null,null,"",null,null,null,"",null,null,null,null,null,null,null,"",null,{"$f":"IF(AG82*1.5=0,\"\",IF(AG82*1.5>'Contract Info'!$D$38,'Contract Info'!$D$38,AG82*1.5))","v":""},null,{"$f":"IF(AS82=\"\",\"\",IF(AQ82=\"\",\"\",AQ82*AS82*24))","v":""},null,null,null,0.25,null,"",null,null,null,0]
[null,null,null,null,null,null,null,null,null,null,null,null,null,null,null,null,null,null,null,null,null,"Total Personnel Regular Time (Base Pay) Cost",null,null,null,null,null,null,null,null,null,null,null,{"$f":"SUM(AI73:AJ82)","v":1121.0400000000002},null,null,null,null,null,null,null,null,null,null,null,null,null,null,null,null,null,null,null,{"$f":"SUM(BB73:BB82)","v":0},{"$f":"SUM(BC73:BC82)","v":0},{"$f":"SUM(BD73:BD82)","v":0}]
[null,"Notes:","TOD for helitack 0800-1630 M-F until May 22nd then switches to 7 day coverage.",null,null,null,null,null,null,null,null,null,null,null,null,null,null,null,null,null,null,"Total Personnel Premium Pay (OT + Haz + Trv) Cost",null,null,null,null,null,null,null,null,null,null,null,null,null,null,{"$f":"AT84+AZ84+BE84","v":450.39750000000004},null,null,null,null,null,null,"=",null,{"$f":"SUM(AU73:AV82)","v":391.65000000000003},null,null,null,"+",null,{"$f":"SUM(BA73:BA82)","v":58.747500000000002},null,"+",null,null,{"$f":"SUM(BE73:BE82)","v":0}]
[]
[null,null,null,null,null,null,null,null,null,null,null,null,null,null,null,null,null,null,null,null,null,null,"     Helicopter Daily Cost Summary"]
[null,null,null,null,null,null,null,null,null,null,null,null,null,null,null,null,"Helicopter:",null,{"$f":"'Contract Info'!D3","v":"N836TJ"},null,null,null,null,null,null,null,null,null,null,null,null,null,null,null,null,null,null,null,null,null,null,null,null,null,null,"Notes:"]
[null,null,null,null,null,null,null,null,null,null,null,null,null,null,null,null,"Make/Model:",null,{"$f":"'Contract Info'!D4","v":"Airbus H-125"},null,null,null,null,null,null,null,"Rate",null,null,"Total",null,null,"Surchrge",null,"Surcharge",null,null,"Total",null,null,null,null,null,null,null,"This is simply a test…."]
[null,null,null,null,null,null,null,null,null,null,null,null,null,null,null,null,"Contractor:",null,{"$f":"N6","v":"Butterfly Airways, Inc."},null,null,null,"Persons",null,"Quantity",null,null,null,null,null,null,null,"%",null,"Total",null,null,"w/ Surcharge"]
[null,null,null,null,null,null,null,null,null,null,null,null,null,null,null,null,"Flight Time",null,null,null,null,null,null,null,{"$f":"AH16","v":0},null,{"$f":"AM16","v":1325},null,null,{"$f":"AS16","v":0},null,null,0,null,{"$f":"PRODUCT(AD90,AG90)","v":0},null,null,{"$f":"SUM(AD90,AI90)","v":0}]
[null,null,null,null,null,null,null,null,null,null,null,null,null,null,null,null,"Availability (hours or day)",null,null,null,null,null,null,null,{"$f":"AH18","v":1},null,{"$f":"AM18","v":3695},null,null,{"$f":"AS18","v":3695},null,null,-1,null,-3695,null,null,0]
[null,null,null,null,null,null,null,null,null,null,null,null,null,null,null,null,"Pilot Extended Standby",null,null,null,null,null,{"$f":"AE20","v":1},null,{"$f":"AH20","v":"0"},null,{"$f":"AM20","v":52},null,null,{"$f":"AS20","v":0},null,null,0,null,0,null,null,0]
[null,null,null,null,null,null,null,null,null,null,null,null,null,null,null,null,"Driver Extended Standby",null,null,null,null,null,{"$f":"AE22","v":0},null,{"$f":"AH22","v":"0"},null,{"$f":"AM22","v":39},null,null,{"$f":"AS22","v":0},null,null,0,null,0,null,null,0]
[null,null,null,null,null,null,null,null,null,null,null,null,null,null,null,null,"Mechanic  Extended Standby",null,null,null,null,null,{"$f":"AE24","v":1},null,{"$f":"AH24","v":2.59},null,{"$f":"AM24","v":59.59},null,null,{"$f":"AS24","v":154.3381},null,null,0,null,0,null,null,154.3381]
[null,null,null,null,null,null,null,null,null,null,null,null,null,null,null,null,"Per Diem or RON",null,null,null,null,null,{"$f":"AE26","v":2},null,null,null,{"$f":"AM26","v":169},null,null,{"$f":"AS26","v":338},null,null,0,null,0,null,null,338]
[null,null,null,null,null,null,null,null,null,null,null,null,null,null,null,null,"Service Truck Miles",null,null,null,null,null,null,null,{"$f":"AH28","v":0},null,{"$f":"AM28","v":2.4500000000000002},null,null,{"$f":"AS28","v":0},null,null,0,null,0,null,null,0]
[null,null,null,null,null,null,null,null,null,null,null,null,null,null,null,null,"Additnl Crew Extended Standby",null,null,null,null,null,{"$f":"AE30","v":0},null,{"$f":"AH30","v":0},null,{"$f":"AM30","v":10},null,null,{"$f":"AS30","v":0},null,null,0,null,0,null,null,0]
[null,null,null,null,null,null,null,null,null,null,null,null,null,null,null,null,"Add'l Cost:",null,{"$f":"Z32","v":0},null,null,null,{"$f":"AE32","v":0},null,{"$f":"AH32","v":0},null,{"$f":"AM32","v":0},null,null,{"$f":"AS32","v":0},null,null,0,null,0,null,null,0]
[null,null,null,null,null,null,null,null,null,null,null,null,null,null,null,null,"Add'l Cost:",null,{"$f":"Z34","v":0},null,null,null,{"$f":"AE34","v":0},null,{"$f":"AH34","v":0},null,{"$f":"AM34","v":0},null,null,{"$f":"AS34","v":0},null,null,0,null,0,null,null,0]
[null,null,null,null,null,null,null,null,null,null,null,null,null,null,null,null,"Add'l Cost:",null,{"$f":"Z36","v":0},null,null,null,{"$f":"AE36","v":0},null,{"$f":"AH36","v":0},null,{"$f":"AM36","v":0},null,null,{"$f":"AS36","v":0},null,null,0,null,0,null,null,0]
[null,null,null,null,null,null,null,null,null,null,null,null,null,null,null,null,"Add'l Cost:",null,null,null,null,null,null,null,null,null,null,null,null,{"$f":"PRODUCT(W101,Y101,AA101)","v":0},null,null,0,null,0,null,null,0]
[null,null,null,null,null,null,null,null,null,null,null,null,null,null,null,null,null,null,null,null,null,"Total Helicopter Costs",null,null,null,null,null,null,null,null,null,null,null,null,null,null,{"$f":"SUM(AL90:AN101)","v":492.3381}]
[null,null,null,null,null,null,null,null,null,null,null,null,null,null,null,null,null,null,null,null,null,null,null,null,null,null,null,null,null,null,null,null,null,null,null,null,null,null,null,null,null,null,null,null,null,{"$f":"BH18","v":"Wilderness Flight Time"},null,null,null,null,null,null,null,null,null,null,{"$f":"BN18","v":5}]
[null,null,null,null,null,null,null,null,null,null,null,null,null,null,null,null,null,null,null,null,null,null,null,null,null,null,null,null,null,null,null,null,null,null,null,null,null,null,null,null,null,null,null,null,null,{"$f":"BH20","v":"Wilderness Landings"},null,null,null,null,null,null,null,null,null,null,{"$f":"BN20","v":4}]
[null,null,null,null,null,null,null,null,null,null,null,null,null,null,null,null,null,null,"Your Cost",null,null,"       Your Cost","N","Include personnel base hours in total cost (Y or N)",null,null,null,null,null,null,null,null,null,null,null,null,null,null,null,null,null,null,null,null,null,{"$f":"BH22","v":"Wilderness Ext. Load Deliveries or Pickups (non-s-h)"},null,null,null,null,null,null,null,null,null,null,{"$f":"BN22","v":3}]
[null,null,null,null,null,null,null,null,null,null,null,null,null,null,null,null,null,null,null,null,null,null,null,null,null,null,null,null,null,null,null,null,null,null,null,null,null,null,null,null,null,null,null,null,null,{"$f":"BH24","v":"Wilderness Short-hauls"},null,null,null,null,null,null,null,null,null,null,{"$f":"BN24","v":2}]
[null,null,null,null,null,null,null,null,null,null,null,null,null,null,null,null,{"$f":"IF(W105=\"y\",\"Total Personnel Base and Premium Pay + Helicopter Costs\",IF(W105=\"Y\",\"Total Personnel Base and Premium Pay + Helicopter Costs\",IF(W105=\"yes\",\"Total Personnel Base and Premium Pay + Helicopter Costs\",IF(W105=\"YES\",\"Total Personnel Base and Premium Pay + Helicopter Costs\",IF(W105=\"Yes\",\"Total Personnel Base and Premium Pay + Helicopter Costs\",\"Total Personnel Premium Pay + Helicopter Costs\")))))","v":"Total Personnel Premium Pay + Helicopter Costs"},null,null,null,null,null,null,null,null,null,null,null,null,null,null,null,null,null,null,null,{"$f":"IF(W105=\"y\",SUM(AK84,AH83,AK102),IF(W105=\"Y\",SUM(AK84,AH83,AK102),IF(W105=\"yes\",SUM(AK84,AH83,AK102),IF(W105=\"YES\",SUM(AK84,AH83,AK102),IF(W105=\"Yes\",SUM(AK84,AH83,AK102),SUM(AK84,AK102))))))","v":942.73559999999998},null,null,null,null,null,null,null,null,{"$f":"BH26","v":"Initial Attacks"},null,null,null,null,null,null,null,null,null,null,{"$f":"BN26","v":1}]
[null,null,null,null,null,null,null,null,null,null,null,null,null,null,null,null,null,null,null,null,null,null,null,null,null,null,null,null,null,null,null,null,null,null,null,null,null,null,null,null,null,null,null,null,null,null,null,null,null,null,null,null,null,null,{"$f":"A1","v":"SuperManager v3.23 SEKI"}]
[]
[]
[]
[]
[]
[]
[]
[]
[]
[]
[]
[]
[]
[]
[]
[]
[]
[]
[]
[]
[]
[]
[]
[]
[]
[]
[]
[]
[null,null,null,null,null,null,null,null,null,null,null,"Lbs","H2O","Retard","Foam",null,"Use","Time","Revnue"]
[null,null,null,null,null,null,null,null,null,null,"PAX","Cargo","Buckts","Buckts","Buckts","Acct","Code","Cost","flight?"]
[null,null,null,null,null,null,null,null,null,null,{"$f":"IF($S29=\"\",K29,\"\")","v":0},0,0,0,0,null,null,{"$f":"IF($S29=\"\",R29,\"\")","v":""}]
[null,null,null,null,null,null,null,null,null,null,0,0,0,0,0,null,null,""]
[null,null,null,null,null,null,null,null,null,null,0,{"$f":"IF($S31=\"\",L31,\"\")","v":0},0,0,0,null,null,""]
[null,null,null,null,null,null,null,null,null,null,0,0,0,0,0,null,null,""]
[null,null,null,null,null,null,null,null,null,null,0,0,0,0,0,null,null,""]
[null,null,null,null,null,null,null,null,null,null,0,0,0,0,0,null,null,""]
[null,null,null,null,null,null,null,null,null,null,0,0,0,0,0,null,null,""]
[null,null,null,null,null,null,null,null,null,null,0,0,0,0,0,null,null,""]
[null,null,null,null,null,null,null,null,null,null,0,0,0,0,0,null,null,""]
[null,null,null,null,null,null,null,null,null,null,0,0,0,0,0,null,null,""]
[null,null,null,null,null,null,null,null,null,null,0,0,0,0,0,null,null,""]
[null,null,null,null,null,null,null,null,null,null,0,0,0,0,0,null,null,""]
[null,null,null,null,null,null,null,null,null,null,0,0,0,0,0,null,null,""]
[null,null,null,null,null,null,null,null,null,null,0,0,0,0,0,null,null,""]
[null,null,null,null,null,null,null,null,null,null,0,0,0,0,0,null,null,""]
[null,null,null,null,null,null,null,null,null,null,0,0,0,0,0,null,null,""]
[null,null,null,null,null,null,null,null,null,null,{"$f":"IF($S45=\"\",K45,\"\")","v":0},0,0,0,0,null,null,""]
[null,null,null,null,null,null,null,null,null,null,0,0,0,0,0,null,null,""]
[null,null,null,null,null,null,null,null,null,null,0,0,0,0,0,null,null,""]
[null,null,null,null,null,null,null,null,null,null,0,0,0,0,0,null,null,""]
[null,null,null,null,null,null,null,null,null,null,0,0,0,0,0,null,null,""]
[null,null,null,null,null,null,null,null,null,null,0,0,0,0,0,null,null,""]
[null,null,null,null,null,null,null,null,null,null,0,0,0,0,0,null,null,""]
[null,null,null,null,null,null,null,null,null,null,0,0,0,0,0,null,null,""]
[null,null,null,null,null,null,null,null,null,null,0,0,0,0,0,null,null,""]
[null,null,null,null,null,null,null,null,null,null,0,0,0,0,0,null,null,""]
[null,null,null,null,null,null,null,null,null,null,0,0,0,0,0,null,null,""]
[null,null,null,null,null,null,null,null,null,null,{"$f":"SUM(K139:K165)","v":0},0,0,0,0,null,null,0]
[null,null,null,null,null,null,null,null,null,null,"PAX","Lbs","H2O","Retard","Foam","Acct","Use","Flight","Non-"]
[null,null,null,null,null,null,null,null,null,null,null,"Cargo","Buckts","Buckts","Buckts",null,"Code","Time","revenue"]
[null,null,null,null,null,null,null,null,null,null,null,null,null,null,null,null,null,"Cost","flight?"]
[]
[]
[]
[]
[]
[]
[]
[null,null,null,null,null,null,null,null,null,null,{"$f":"K69","v":0}]

{"sheet":"HCM-12 Pilot Duty Segovia","index":6,"n_rows":53,"n_cols":45,"rows_kept":53,"cut":false,"hidden":false,"merged":[[33,18,33,21],[33,23,33,26],[33,28,33,31],[32,27,32,31],[30,37,30,41],[30,42,30,46],[31,37,31,41],[31,42,31,46],[34,0,34,11],[34,12,34,16],[34,17,34,21],[34,22,34,26],[32,0,32,11],[32,12,32,16],[32,17,32,21],[32,22,32,26],[33,0,33,11],[33,13,33,16],[30,0,30,11],[30,12,30,16],[30,17,30,21],[30,22,30,26],[30,27,30,31],[30,32,30,36],[31,0,31,11],[31,12,31,16],[31,17,31,21],[31,22,31,26],[31,27,31,31],[31,32,31,36],[28,0,28,11],[28,12,28,16],[28,17,28,21],[28,22,28,26],[28,27,28,31],[28,32,28,36],[28,37,28,41],[28,42,28,46],[29,0,29,11],[29,13,29,16],[29,18,29,21],[29,23,29,26],[29,28,29,31],[29,33,29,36],[29,38,29,41],[29,43,29,46],[26,32,26,36],[26,37,26,41],[23,0,23,11],[23,13,23,16],[23,18,23,21],[23,23,23,26],[26,42,26,46],[27,0,27,11],[27,12,27,16],[27,17,27,21],[27,22,27,26],[27,27,27,31],[27,32,27,36],[27,37,27,41],[27,42,27,46],[24,0,24,11],[24,12,24,16],[24,17,24,21],[24,22,24,26],[24,32,24,36],[24,37,24,41],[24,42,24,46],[23,33,23,36],[23,38,23,41],[24,27,24,31],[23,28,23,31],[26,0,26,11],[26,12,26,16],[26,17,26,21],[26,22,26,26],[26,27,26,31],[21,0,21,11],[21,12,21,16],[21,17,21,21],[21,22,21,26],[21,27,21,31],[17,17,17,21],[17,22,17,26],[18,22,18,26],[18,27,18,31],[18,37,18,41],[18,42,18,46],[19,38,19,41],[17,42,17,46],[22,27,22,31],[34,27,34,31],[16,0,16,11],[16,12,16,16],[19,0,19,11],[19,18,19,21],[19,23,19,26],[19,28,19,31],[19,13,19,16],[18,0,18,11],[18,12,18,16],[20,0,20,11],[20,12,20,16],[20,17,20,21],[20,22,20,26],[20,27,20,31],[18,17,18,21],[22,0,22,11],[22,12,22,16],[22,17,22,21],[22,22,22,26],[16,22,16,26],[16,27,16,31],[17,0,17,11],[17,12,17,16],[34,32,34,36],[34,37,34,41],[34,42,34,46],[32,32,32,36],[32,37,32,41],[32,42,32,46],[33,33,33,36],[33,38,33,41],[33,43,33,46],[23,43,23,46],[19,43,19,46],[21,37,21,41],[21,42,21,46],[18,32,18,36],[19,33,19,36],[20,32,20,36],[22,32,22,36],[20,37,20,41],[20,42,20,46],[21,32,21,36],[22,37,22,41],[22,42,22,46],[4,32,4,34],[4,35,4,37],[17,37,17,41],[9,38,9,41],[8,42,8,46],[16,32,16,36],[17,32,17,36],[14,42,14,46],[14,37,14,41],[12,27,12,31],[14,17,14,21],[14,22,14,26],[12,32,12,36],[13,0,13,11],[16,42,16,46],[1,27,1,36],[3,32,3,34],[3,35,3,37],[3,0,3,31],[12,37,12,41],[12,42,12,46],[11,12,11,16],[11,17,11,21],[3,44,3,46],[10,32,10,36],[8,17,8,21],[8,22,8,26],[11,0,11,11],[3,38,3,40],[3,41,3,43],[4,44,4,46],[4,38,4,40],[4,41,4,43],[12,22,12,26],[10,37,10,41],[10,42,10,46],[11,37,11,41],[11,42,11,46],[52,0,52,46],[47,0,47,46],[46,31,46,34],[46,29,46,30],[44,17,44,21],[44,12,44,16],[44,0,44,11],[46,11,46,16],[46,19,46,21],[46,6,46,7],[46,17,46,18],[44,42,44,46],[44,37,44,41],[44,32,44,36],[44,27,44,31],[44,22,44,26],[49,0,50,46],[48,36,48,46],[48,0,48,4],[48,6,48,34],[46,22,46,28],[46,42,46,46],[46,35,46,41],[46,0,46,5],[46,8,46,10],[41,22,41,26],[41,17,41,21],[41,12,41,16],[41,0,41,11],[41,42,41,46],[41,37,41,41],[41,32,41,36],[41,27,41,31],[43,13,43,16],[43,0,43,11],[42,42,42,46],[42,37,42,41],[42,32,42,36],[42,27,42,31],[42,22,42,26],[42,17,42,21],[42,12,42,16],[42,0,42,11],[43,33,43,36],[43,28,43,31],[43,23,43,26],[43,18,43,21],[43,43,43,46],[43,38,43,41],[39,23,39,26],[39,18,39,21],[39,13,39,16],[39,0,39,11],[39,43,39,46],[39,38,39,41],[39,33,39,36],[39,28,39,31],[40,22,40,26],[40,17,40,21],[40,12,40,16],[40,0,40,11],[40,42,40,46],[40,37,40,41],[40,32,40,36],[40,27,40,31],[37,22,37,26],[37,17,37,21],[37,12,37,16],[37,0,37,11],[37,42,37,46],[37,37,37,41],[37,32,37,36],[37,27,37,31],[38,22,38,26],[38,17,38,21],[38,12,38,16],[38,0,38,11],[38,42,38,46],[38,37,38,41],[38,32,38,36],[38,27,38,31],[36,22,36,26],[36,17,36,21],[8,27,8,31],[10,22,10,26],[10,27,10,31],[9,23,9,26],[13,18,13,21],[13,23,13,26],[17,27,17,31],[16,17,16,21],[25,0,25,46],[36,12,36,16],[36,0,36,11],[36,42,36,46],[36,37,36,41],[36,32,36,36],[36,27,36,31],[14,27,14,31],[14,32,14,36],[9,33,9,36],[8,37,8,41],[8,0,8,11],[8,12,8,16],[8,32,8,36],[0,0,0,38],[0,39,0,46],[1,37,1,46],[9,43,9,46],[7,42,7,46],[6,0,6,11],[7,0,7,11],[6,42,6,46],[7,37,7,41],[6,37,6,41],[6,17,6,21],[6,22,6,26],[7,22,7,26],[7,27,7,31],[6,27,6,31],[6,12,6,16],[6,32,6,36],[9,28,9,31],[9,0,9,11],[7,32,7,36],[7,12,7,16],[7,17,7,21],[1,0,1,5],[1,6,1,26],[35,0,35,46],[4,0,4,31],[2,0,2,46],[5,0,5,46],[15,0,15,46],[9,13,9,16],[9,18,9,21],[13,28,13,31],[13,33,13,36],[13,38,13,41],[11,27,11,31],[13,43,13,46],[11,22,11,26],[11,32,11,36],[12,0,12,11],[12,12,12,16],[12,17,12,21],[10,0,10,11],[10,12,10,16],[10,17,10,21],[13,13,13,16],[14,0,14,11],[14,12,14,16],[16,37,16,41]]}
[{"$f":"'Contract Info'!A1:G1","v":"SuperManager v3.23 SEKI"}]
["Pilot Name:",null,null,null,null,null,"Frank Segovia",null,null,null,null,null,null,null,null,null,null,null,null,null,null,null,null,null,null,null,null,"Last Date(s) Off-Duty:",null,null,null,null,null,null,null,null,null,"5/17 & 5/18"]
[]
["Flight Time or, Off, for the Last 5 Consecutive Days:",null,null,null,null,null,null,null,null,null,null,null,null,null,null,null,null,null,null,null,null,null,null,null,null,null,null,null,null,null,null,null,{"$f":"M7-5","v":"2023-05-14"},null,null,{"$f":"M7-4","v":"2023-05-15"},null,null,{"$f":"M7-3","v":"2023-05-16"},null,null,{"$f":"M7-2","v":"2023-05-17"},null,null,{"$f":"M7-1","v":"2023-05-18"}]
[null,null,null,null,null,null,null,null,null,null,null,null,null,null,null,null,null,null,null,null,null,null,null,null,null,null,null,null,null,null,null,null,0,null,null,0,null,null,0,null,null,"OFF",null,null,"OFF"]
[]
["Insert Dates of Next 7 Days:",null,null,null,null,null,null,null,null,null,null,null,"2023-05-19",null,null,null,null,{"$f":"M7+1","v":"2023-05-20"},null,null,null,null,{"$f":"R7+1","v":"2023-05-21"},null,null,null,null,{"$f":"W7+1","v":"2023-05-22"},null,null,null,null,{"$f":"AB7+1","v":"2023-05-23"},null,null,null,null,{"$f":"AG7+1","v":"2023-05-24"},null,null,null,null,{"$f":"AL7+1","v":"2023-05-25"}]
["Earliest Pilot Can Be On-Duty:",null,null,null,null,null,null,null,null,null,null,null,400.16666666666669,null,null,null,null,{"$f":"IF(M12=\"\",\"\",SUM(M12+$AD$47))","v":1.1041666666666667},null,null,null,null,{"$f":"IF(R12=\"\",\"\",SUM(R12+$AD$47))","v":""},null,null,null,null,{"$f":"IF(W12=\"\",\"\",SUM(W12+$AD$47))","v":""},null,null,null,null,{"$f":"IF(AB12=\"\",\"\",SUM(AB12+$AD$47))","v":""},null,null,null,null,{"$f":"IF(AG12=\"\",\"\",SUM(AG12+$AD$47))","v":""},null,null,null,null,{"$f":"IF(AL12=\"\",\"\",SUM(AL12+$AD$47))","v":""}]
["Actual On-Duty Time (Including Preflight)",null,null,null,null,null,null,null,null,null,null,null,"07:30:00"]
["Add 14 Hours For Maximum Duty Day",null,null,null,null,null,null,null,null,null,null,null,"+",{"$f":"$R$47","v":"14:00:00"},null,null,null,"+",{"$f":"$R$47","v":"14:00:00"},null,null,null,"+",{"$f":"$R$47","v":"14:00:00"},null,null,null,"+",{"$f":"$R$47","v":"14:00:00"},null,null,null,"+",{"$f":"$R$47","v":"14:00:00"},null,null,null,"+",{"$f":"$R$47","v":"14:00:00"},null,null,null,"+",{"$f":"$R$47","v":"14:00:00"}]
["Must Be Off-Duty At:",null,null,null,null,null,null,null,null,null,null,null,{"$f":"IF(M9=\"Off\",\"off\",IF(M9=\"\",\"\",SUM(M9+N10)))","v":"21:30:00"},null,null,null,null,{"$f":"IF(R9=\"Off\",\"off\",IF(R9=\"\",\"\",SUM(R9+S10)))","v":""},null,null,null,null,{"$f":"IF(W9=\"Off\",\"off\",IF(W9=\"\",\"\",SUM(W9+X10)))","v":""},null,null,null,null,{"$f":"IF(AB9=\"Off\",\"off\",IF(AB9=\"\",\"\",SUM(AB9+AC10)))","v":""},null,null,null,null,{"$f":"IF(AG9=\"Off\",\"off\",IF(AG9=\"\",\"\",SUM(AG9+AH10)))","v":""},null,null,null,null,{"$f":"IF(AL9=\"Off\",\"off\",IF(AL9=\"\",\"\",SUM(AL9+AM10)))","v":""},null,null,null,null,{"$f":"IF(AQ9=\"Off\",\"off\",IF(AQ9=\"\",\"\",SUM(AQ9+AR10)))","v":""}]
["Actual Off-Duty Time:",null,null,null,null,null,null,null,null,null,null,null,"16:30:00"]
["Cumulative Flight Time Previous 5 Days:",null,null,null,null,null,null,null,null,null,null,null,{"$f":"IF(AS5=\"\",\"\",IF(AS5=\"Off\",\"0\",IF(AP5=\"Off\",SUM(AS5),IF(AM5=\"Off\",SUM(AP5:AU5),IF(AJ5=\"Off\",SUM(AM5:AU5),IF(AG5=\"Off\",SUM(AJ5:AU5),(SUM(AG5:AU5,))))))))","v":"0"},null,null,null,null,{"$f":"IF(N14=\"\",\"\",IF(N14=\"Off\",\"0\",IF(AS5=\"Off\",SUM(N14),IF(AP5=\"Off\",SUM(AS5+N14),IF(AM5=\"Off\",SUM(AP5+AS5+N14),IF(AJ5=\"Off\",SUM(AM5+AP5+AS5+N14),(SUM(AJ5+AM5+AP5+AS5+N14))))))))","v":""},null,null,null,null,{"$f":"IF(S14=\"\",\"\",IF(S14=\"Off\",\"0\",IF(N14=\"Off\",SUM(S14),IF(AS5=\"Off\",SUM(N14+S14),IF(AP5=\"Off\",SUM(AS5+N14+S14),IF(AM5=\"Off\",SUM(AP5+AS5+N14+S14),(SUM(AM5+AP5+AS5+N14+S14))))))))","v":""},null,null,null,null,{"$f":"IF(X14=\"\",\"\",IF(X14=\"Off\",\"0\",IF(S14=\"Off\",SUM(X14),IF(N14=\"Off\",SUM(S14+X14),IF(AS5=\"Off\",SUM(N14+S14+X14),IF(AP5=\"Off\",SUM(AS5+N14+S14+X14),(SUM(AP5+AS5+N14+S14+X14))))))))","v":""},null,null,null,null,{"$f":"IF(AC14=\"\",\"\",IF(AC14=\"Off\",\"0\",IF(X14=\"Off\",SUM(AC14),IF(S14=\"Off\",SUM(X14+AC14),IF(N14=\"Off\",SUM(S14+X14+AC14),IF(AS5=\"Off\",SUM(N14+S14+X14+AC14),(SUM(AS5+N14+S14+X14+AC14))))))))","v":""},null,null,null,null,{"$f":"IF(AH14=\"\",\"\",IF(AH14=\"Off\",\"0\",IF(AC14=\"Off\",SUM(AH14),IF(X14=\"Off\",SUM(AC14+AH14),IF(S14=\"Off\",SUM(X14+AC14+AH14),IF(N14=\"Off\",SUM(S14+X14+AC14+AH14),(SUM(N14+S14+X14+AC14+AH14))))))))","v":""},null,null,null,null,{"$f":"IF(AM14=\"\",\"\",IF(AM14=\"Off\",\"0\",IF(AH14=\"Off\",SUM(AM14),IF(AC14=\"Off\",SUM(AH14+AM14),IF(X14=\"Off\",SUM(AC14+AH14+AM14),IF(S14=\"Off\",SUM(X14+AC14+AH14+AM14),(SUM(S14+X14+AC14+AH14+AM14))))))))","v":""}]
["Total Flight Time Today:",null,null,null,null,null,null,null,null,null,null,null,"+",null,null,null,null,"+",null,null,null,null,"+",null,null,null,null,"+",null,null,null,null,"+",null,null,null,null,"+",null,null,null,null,"+"]
["Total Flight Time This 6-Day Period:",null,null,null,null,null,null,null,null,null,null,null,{"$f":"IF(N14=\"\",\"\",IF(N14=\"Off\",\"0\",SUM(M13+N14)))","v":""},null,null,null,null,{"$f":"IF(S14=\"\",\"\",IF(S14=\"Off\",\"0\",SUM(R13+S14)))","v":""},null,null,null,null,{"$f":"IF(X14=\"\",\"\",IF(X14=\"Off\",\"0\",SUM(W13+X14)))","v":""},null,null,null,null,{"$f":"IF(AC14=\"\",\"\",IF(AC14=\"Off\",\"0\",SUM(AB13+AC14)))","v":""},null,null,null,null,{"$f":"IF(AH14=\"\",\"\",IF(AH14=\"Off\",\"0\",SUM(AG13+AH14)))","v":""},null,null,null,null,{"$f":"IF(AM14=\"\",\"\",IF(AM14=\"Off\",\"0\",SUM(AL13+AM14)))","v":""},null,null,null,null,{"$f":"IF(AR14=\"\",\"\",IF(AR14=\"Off\",\"0\",SUM(AQ13+AR14)))","v":""}]
[]
["Insert Dates of Next 7 Days:",null,null,null,null,null,null,null,null,null,null,null,{"$f":"AQ7+1","v":"2023-05-26"},null,null,null,null,{"$f":"M17+1","v":"2023-05-27"},null,null,null,null,{"$f":"R17+1","v":"2023-05-28"},null,null,null,null,{"$f":"W17+1","v":"2023-05-29"},null,null,null,null,{"$f":"AB17+1","v":"2023-05-30"},null,null,null,null,{"$f":"AG17+1","v":"2023-05-31"},null,null,null,null,{"$f":"AL17+1","v":"2023-06-01"}]
["Earliest Pilot Can Be On-Duty:",null,null,null,null,null,null,null,null,null,null,null,{"$f":"IF(AQ12=\"\",\"\",SUM(AQ12+$AD$47))","v":""},null,null,null,null,{"$f":"IF(M22=\"\",\"\",SUM(M22+$AD$47))","v":""},null,null,null,null,{"$f":"IF(R22=\"\",\"\",SUM(R22+$AD$47))","v":""},null,null,null,null,{"$f":"IF(W22=\"\",\"\",SUM(W22+$AD$47))","v":""},null,null,null,null,{"$f":"IF(AB22=\"\",\"\",SUM(AB22+$AD$47))","v":""},null,null,null,null,{"$f":"IF(AG22=\"\",\"\",SUM(AG22+$AD$47))","v":""},null,null,null,null,{"$f":"IF(AL22=\"\",\"\",SUM(AL22+$AD$47))","v":""}]
["Actual On-Duty Time (Including Preflight)"]
["Add 14 Hours For Maximum Duty Day",null,null,null,null,null,null,null,null,null,null,null,"+",{"$f":"$R$47","v":"14:00:00"},null,null,null,"+",{"$f":"$R$47","v":"14:00:00"},null,null,null,"+",{"$f":"$R$47","v":"14:00:00"},null,null,null,"+",{"$f":"$R$47","v":"14:00:00"},null,null,null,"+",{"$f":"$R$47","v":"14:00:00"},null,null,null,"+",{"$f":"$R$47","v":"14:00:00"},null,null,null,"+",{"$f":"$R$47","v":"14:00:00"}]
["Must Be Off-Duty At:",null,null,null,null,null,null,null,null,null,null,null,{"$f":"IF(M19=\"Off\",\"off\",IF(M19=\"\",\"\",SUM(M19+N20)))","v":""},null,null,null,null,{"$f":"IF(R19=\"Off\",\"off\",IF(R19=\"\",\"\",SUM(R19+S20)))","v":""},null,null,null,null,{"$f":"IF(W19=\"Off\",\"off\",IF(W19=\"\",\"\",SUM(W19+X20)))","v":""},null,null,null,null,{"$f":"IF(AB19=\"Off\",\"off\",IF(AB19=\"\",\"\",SUM(AB19+AC20)))","v":""},null,null,null,null,{"$f":"IF(AG19=\"Off\",\"off\",IF(AG19=\"\",\"\",SUM(AG19+AH20)))","v":""},null,null,null,null,{"$f":"IF(AL19=\"Off\",\"off\",IF(AL19=\"\",\"\",SUM(AL19+AM20)))","v":""},null,null,null,null,{"$f":"IF(AQ19=\"Off\",\"off\",IF(AQ19=\"\",\"\",SUM(AQ19+AR20)))","v":""}]
["Actual Off-Duty Time:"]
["Cumulative Flight Time Previous 5 Days:",null,null,null,null,null,null,null,null,null,null,null,{"$f":"IF(AR14=\"\",\"\",IF(AR14=\"Off\",\"0\",IF(AM14=\"Off\",SUM(AR14),IF(AH14=\"Off\",SUM(AM14+AR14),IF(AC14=\"Off\",SUM(AH14+AM14+AR14),IF(X14=\"Off\",SUM(AC14+AH14+AM14+AR14),(SUM(X14+AC14+AH14+AM14+AR14))))))))","v":""},null,null,null,null,{"$f":"IF(N24=\"\",\"\",IF(N24=\"Off\",\"0\",IF(AR14=\"Off\",SUM(N24),IF(AM14=\"Off\",SUM(AR14+N24),IF(AH14=\"Off\",SUM(AM14+AR14+N24),IF(AC14=\"Off\",SUM(AH14+AM14+AR14+N24),(SUM(AC14+AH14+AM14+AR14+N24))))))))","v":""},null,null,null,null,{"$f":"IF(S24=\"\",\"\",IF(S24=\"Off\",\"0\",IF(N24=\"Off\",SUM(S24),IF(AR14=\"Off\",SUM(N24+S24),IF(AM14=\"Off\",SUM(AR14+N24+S24),IF(AH14=\"Off\",SUM(AM14+AR14+N24+S24),(SUM(AH14+AM14+AR14+N24+S24))))))))","v":""},null,null,null,null,{"$f":"IF(X24=\"\",\"\",IF(X24=\"Off\",\"0\",IF(S24=\"Off\",SUM(X24),IF(N24=\"Off\",SUM(S24+X24),IF(AR14=\"Off\",SUM(N24+S24+X24),IF(AM14=\"Off\",SUM(AR14+N24+S24+X24),(SUM(AM14+AR14+N24+S24+X24))))))))","v":""},null,null,null,null,{"$f":"IF(AC24=\"\",\"\",IF(AC24=\"Off\",\"0\",IF(X24=\"Off\",SUM(AC24),IF(S24=\"Off\",SUM(X24+AC24),IF(N24=\"Off\",SUM(S24+X24+AC24),IF(AR14=\"Off\",SUM(N24+S24+X24+AC24),(SUM(AR14+N24+S24+X24+AC24))))))))","v":""},null,null,null,null,{"$f":"IF(AH24=\"\",\"\",IF(AH24=\"Off\",\"0\",IF(AC24=\"Off\",SUM(AH24),IF(X24=\"Off\",SUM(AC24+AH24),IF(S24=\"Off\",SUM(X24+AC24+AH24),IF(N24=\"Off\",SUM(S24+X24+AC24+AH24),(SUM(N24+S24+X24+AC24+AH24))))))))","v":""},null,null,null,null,{"$f":"IF(AM24=\"\",\"\",IF(AM24=\"Off\",\"0\",IF(AH24=\"Off\",SUM(AM24),IF(AC24=\"Off\",SUM(AH24+AM24),IF(X24=\"Off\",SUM(AC24+AH24+AM24),IF(S24=\"Off\",SUM(X24+AC24+AH24+AM24),(SUM(S24+X24+AC24+AH24+AM24))))))))","v":""}]
["Total Flight Time Today:",null,null,null,null,null,null,null,null,null,null,null,"+",null,null,null,null,"+",null,null,null,null,"+",null,null,null,null,"+",null,null,null,null,"+",null,null,null,null,"+",null,null,null,null,"+"]
["Total Flight Time This 6-Day Period:",null,null,null,null,null,null,null,null,null,null,null,{"$f":"IF(N24=\"\",\"\",IF(N24=\"Off\",\"0\",SUM(M23+N24)))","v":""},null,null,null,null,{"$f":"IF(S24=\"\",\"\",IF(S24=\"Off\",\"0\",SUM(R23+S24)))","v":""},null,null,null,null,{"$f":"IF(X24=\"\",\"\",IF(X24=\"Off\",\"0\",SUM(W23+X24)))","v":""},null,null,null,null,{"$f":"IF(AC24=\"\",\"\",IF(AC24=\"Off\",\"0\",SUM(AB23+AC24)))","v":""},null,null,null,null,{"$f":"IF(AH24=\"\",\"\",IF(AH24=\"Off\",\"0\",SUM(AG23+AH24)))","v":""},null,null,null,null,{"$f":"IF(AM24=\"\",\"\",IF(AM24=\"Off\",\"0\",SUM(AL23+AM24)))","v":""},null,null,null,null,{"$f":"IF(AR24=\"\",\"\",IF(AR24=\"Off\",\"0\",SUM(AQ23+AR24)))","v":""}]
[]
["Insert Dates of Next 7 Days:",null,null,null,null,null,null,null,null,null,null,null,{"$f":"AQ17+1","v":"2023-06-02"},null,null,null,null,{"$f":"M27+1","v":"2023-06-03"},null,null,null,null,{"$f":"R27+1","v":"2023-06-04"},null,null,null,null,{"$f":"W27+1","v":"2023-06-05"},null,null,null,null,{"$f":"AB27+1","v":"2023-06-06"},null,null,null,null,{"$f":"AG27+1","v":"2023-06-07"},null,null,null,null,{"$f":"AL27+1","v":"2023-06-08"}]
["Earliest Pilot Can Be On-Duty:",null,null,null,null,null,null,null,null,null,null,null,{"$f":"IF(AQ22=\"\",\"\",SUM(AQ22+$AD$47))","v":""},null,null,null,null,{"$f":"IF(M32=\"\",\"\",SUM(M32+$AD$47))","v":""},null,null,null,null,{"$f":"IF(R32=\"\",\"\",SUM(R32+$AD$47))","v":""},null,null,null,null,{"$f":"IF(W32=\"\",\"\",SUM(W32+$AD$47))","v":""},null,null,null,null,{"$f":"IF(AB32=\"\",\"\",SUM(AB32+$AD$47))","v":""},null,null,null,null,{"$f":"IF(AG32=\"\",\"\",SUM(AG32+$AD$47))","v":""},null,null,null,null,{"$f":"IF(AL32=\"\",\"\",SUM(AL32+$AD$47))","v":""}]
["Actual On-Duty Time (Including Preflight)"]
["Add 14 Hours For Maximum Duty Day",null,null,null,null,null,null,null,null,null,null,null,"+",{"$f":"$R$47","v":"14:00:00"},null,null,null,"+",{"$f":"$R$47","v":"14:00:00"},null,null,null,"+",{"$f":"$R$47","v":"14:00:00"},null,null,null,"+",{"$f":"$R$47","v":"14:00:00"},null,null,null,"+",{"$f":"$R$47","v":"14:00:00"},null,null,null,"+",{"$f":"$R$47","v":"14:00:00"},null,null,null,"+",{"$f":"$R$47","v":"14:00:00"}]
["Must Be Off-Duty At:",null,null,null,null,null,null,null,null,null,null,null,{"$f":"IF(M29=\"Off\",\"off\",IF(M29=\"\",\"\",SUM(M29+N30)))","v":""},null,null,null,null,{"$f":"IF(R29=\"Off\",\"off\",IF(R29=\"\",\"\",SUM(R29+S30)))","v":""},null,null,null,null,{"$f":"IF(W29=\"Off\",\"off\",IF(W29=\"\",\"\",SUM(W29+X30)))","v":""},null,null,null,null,{"$f":"IF(AB29=\"Off\",\"off\",IF(AB29=\"\",\"\",SUM(AB29+AC30)))","v":""},null,null,null,null,{"$f":"IF(AG29=\"Off\",\"off\",IF(AG29=\"\",\"\",SUM(AG29+AH30)))","v":""},null,null,null,null,{"$f":"IF(AL29=\"Off\",\"off\",IF(AL29=\"\",\"\",SUM(AL29+AM30)))","v":""},null,null,null,null,{"$f":"IF(AQ29=\"Off\",\"off\",IF(AQ29=\"\",\"\",SUM(AQ29+AR30)))","v":""}]
["Actual Off-Duty Time:"]
["Cumulative Flight Time Previous 5 Days:",null,null,null,null,null,null,null,null,null,null,null,{"$f":"IF(AR24=\"\",\"\",IF(AR24=\"Off\",\"0\",IF(AM24=\"Off\",SUM(AR24),IF(AH24=\"Off\",SUM(AM24+AR24),IF(AC24=\"Off\",SUM(AH24+AM24+AR24),IF(X24=\"Off\",SUM(AC24+AH24+AM24+AR24),(SUM(X24+AC24+AH24+AM24+AR24))))))))","v":""},null,null,null,null,{"$f":"IF(N34=\"\",\"\",IF(N34=\"Off\",\"0\",IF(AR24=\"Off\",SUM(N34),IF(AM24=\"Off\",SUM(AR24+N34),IF(AH24=\"Off\",SUM(AM24+AR24+N34),IF(AC24=\"Off\",SUM(AH24+AM24+AR24+N34),(SUM(AC24+AH24+AM24+AR24+N34))))))))","v":""},null,null,null,null,{"$f":"IF(S34=\"\",\"\",IF(S34=\"Off\",\"0\",IF(N34=\"Off\",SUM(S34),IF(AR24=\"Off\",SUM(N34+S34),IF(AM24=\"Off\",SUM(AR24+N34+S34),IF(AH24=\"Off\",SUM(AM24+AR24+N34+S34),(SUM(AH24+AM24+AR24+N34+S34))))))))","v":""},null,null,null,null,{"$f":"IF(X34=\"\",\"\",IF(X34=\"Off\",\"0\",IF(S34=\"Off\",SUM(X34),IF(N34=\"Off\",SUM(S34+X34),IF(AR24=\"Off\",SUM(N34+S34+X34),IF(AM24=\"Off\",SUM(AR24+N34+S34+X34),(SUM(AM24+AR24+N34+S34+X34))))))))","v":""},null,null,null,null,{"$f":"IF(AC34=\"\",\"\",IF(AC34=\"Off\",\"0\",IF(X34=\"Off\",SUM(AC34),IF(S34=\"Off\",SUM(X34+AC34),IF(N34=\"Off\",SUM(S34+X34+AC34),IF(AR24=\"Off\",SUM(N34+S34+X34+AC34),(SUM(AR24+N34+S34+X34+AC34))))))))","v":""},null,null,null,null,{"$f":"IF(AH34=\"\",\"\",IF(AH34=\"Off\",\"0\",IF(AC34=\"Off\",SUM(AH34),IF(X34=\"Off\",SUM(AC34+AH34),IF(S34=\"Off\",SUM(X34+AC34+AH34),IF(N34=\"Off\",SUM(S34+X34+AC34+AH34),(SUM(N34+S34+X34+AC34+AH34))))))))","v":""},null,null,null,null,{"$f":"IF(AM34=\"\",\"\",IF(AM34=\"Off\",\"0\",IF(AH34=\"Off\",SUM(AM34),IF(AC34=\"Off\",SUM(AH34+AM34),IF(X34=\"Off\",SUM(AC34+AH34+AM34),IF(S34=\"Off\",SUM(X34+AC34+AH34+AM34),(SUM(S34+X34+AC34+AH34+AM34))))))))","v":""}]
["Total Flight Time Today:",null,null,null,null,null,null,null,null,null,null,null,"+",null,null,null,null,"+",null,null,null,null,"+",null,null,null,null,"+",null,null,null,null,"+",null,null,null,null,"+",null,null,null,null,"+"]
["Total Flight Time This 6-Day Period:",null,null,null,null,null,null,null,null,null,null,null,{"$f":"IF(N34=\"\",\"\",IF(N34=\"Off\",\"0\",SUM(M33+N34)))","v":""},null,null,null,null,{"$f":"IF(S34=\"\",\"\",IF(S34=\"Off\",\"0\",SUM(R33+S34)))","v":""},null,null,null,null,{"$f":"IF(X34=\"\",\"\",IF(X34=\"Off\",\"0\",SUM(W33+X34)))","v":""},null,null,null,null,{"$f":"IF(AC34=\"\",\"\",IF(AC34=\"Off\",\"0\",SUM(AB33+AC34)))","v":""},null,null,null,null,{"$f":"IF(AH34=\"\",\"\",IF(AH34=\"Off\",\"0\",SUM(AG33+AH34)))","v":""},null,null,null,null,{"$f":"IF(AM34=\"\",\"\",IF(AM34=\"Off\",\"0\",SUM(AL33+AM34)))","v":""},null,null,null,null,{"$f":"IF(AR34=\"\",\"\",IF(AR34=\"Off\",\"0\",SUM(AQ33+AR34)))","v":""}]
[]
["Insert Dates of Next 7 Days:",null,null,null,null,null,null,null,null,null,null,null,{"$f":"AQ27+1","v":"2023-06-09"},null,null,null,null,{"$f":"M37+1","v":"2023-06-10"},null,null,null,null,{"$f":"R37+1","v":"2023-06-11"},null,null,null,null,{"$f":"W37+1","v":"2023-06-12"},null,null,null,null,{"$f":"AB37+1","v":"2023-06-13"},null,null,null,null,{"$f":"AG37+1","v":"2023-06-14"},null,null,null,null,{"$f":"AL37+1","v":"2023-06-15"}]
["Earliest Pilot Can Be On-Duty:",null,null,null,null,null,null,null,null,null,null,null,{"$f":"IF(AQ32=\"\",\"\",SUM(AQ32+$AD$47))","v":""},null,null,null,null,{"$f":"IF(M42=\"\",\"\",SUM(M42+$AD$47))","v":""},null,null,null,null,{"$f":"IF(R42=\"\",\"\",SUM(R42+$AD$47))","v":""},null,null,null,null,{"$f":"IF(W42=\"\",\"\",SUM(W42+$AD$47))","v":""},null,null,null,null,{"$f":"IF(AB42=\"\",\"\",SUM(AB42+$AD$47))","v":""},null,null,null,null,{"$f":"IF(AG42=\"\",\"\",SUM(AG42+$AD$47))","v":""},null,null,null,null,{"$f":"IF(AL42=\"\",\"\",SUM(AL42+$AD$47))","v":""}]
["Actual On-Duty Time (Including Preflight)"]
["Add 14 Hours For Maximum Duty Day",null,null,null,null,null,null,null,null,null,null,null,"+",{"$f":"$R$47","v":"14:00:00"},null,null,null,"+",{"$f":"$R$47","v":"14:00:00"},null,null,null,"+",{"$f":"$R$47","v":"14:00:00"},null,null,null,"+",{"$f":"$R$47","v":"14:00:00"},null,null,null,"+",{"$f":"$R$47","v":"14:00:00"},null,null,null,"+",{"$f":"$R$47","v":"14:00:00"},null,null,null,"+",{"$f":"$R$47","v":"14:00:00"}]
["Must Be Off-Duty At:",null,null,null,null,null,null,null,null,null,null,null,{"$f":"IF(M39=\"Off\",\"off\",IF(M39=\"\",\"\",SUM(M39+N40)))","v":""},null,null,null,null,{"$f":"IF(R39=\"Off\",\"off\",IF(R39=\"\",\"\",SUM(R39+S40)))","v":""},null,null,null,null,{"$f":"IF(W39=\"Off\",\"off\",IF(W39=\"\",\"\",SUM(W39+X40)))","v":""},null,null,null,null,{"$f":"IF(AB39=\"Off\",\"off\",IF(AB39=\"\",\"\",SUM(AB39+AC40)))","v":""},null,null,null,null,{"$f":"IF(AG39=\"Off\",\"off\",IF(AG39=\"\",\"\",SUM(AG39+AH40)))","v":""},null,null,null,null,{"$f":"IF(AL39=\"Off\",\"off\",IF(AL39=\"\",\"\",SUM(AL39+AM40)))","v":""},null,null,null,null,{"$f":"IF(AQ39=\"Off\",\"off\",IF(AQ39=\"\",\"\",SUM(AQ39+AR40)))","v":""}]
["Actual Off-Duty Time:"]
["Cumulative Flight Time Previous 5 Days:",null,null,null,null,null,null,null,null,null,null,null,{"$f":"IF(AR34=\"\",\"\",IF(AR34=\"Off\",\"0\",IF(AM34=\"Off\",SUM(AR34),IF(AH34=\"Off\",SUM(AM34+AR34),IF(AC34=\"Off\",SUM(AH34+AM34+AR34),IF(X34=\"Off\",SUM(AC34+AH34+AM34+AR34),(SUM(X34+AC34+AH34+AM34+AR34))))))))","v":""},null,null,null,null,{"$f":"IF(N44=\"\",\"\",IF(N44=\"Off\",\"0\",IF(AR34=\"Off\",SUM(N44),IF(AM34=\"Off\",SUM(AR34+N44),IF(AH34=\"Off\",SUM(AM34+AR34+N44),IF(AC34=\"Off\",SUM(AH34+AM34+AR34+N44),(SUM(AC34+AH34+AM34+AR34+N44))))))))","v":""},null,null,null,null,{"$f":"IF(S44=\"\",\"\",IF(S44=\"Off\",\"0\",IF(N44=\"Off\",SUM(S44),IF(AR34=\"Off\",SUM(N44+S44),IF(AM34=\"Off\",SUM(AR34+N44+S44),IF(AH34=\"Off\",SUM(AM34+AR34+N44+S44),(SUM(AH34+AM34+AR34+N44+S44))))))))","v":""},null,null,null,null,{"$f":"IF(X44=\"\",\"\",IF(X44=\"Off\",\"0\",IF(S44=\"Off\",SUM(X44),IF(N44=\"Off\",SUM(S44+X44),IF(AR34=\"Off\",SUM(N44+S44+X44),IF(AM34=\"Off\",SUM(AR34+N44+S44+X44),(SUM(AM34+AR34+N44+S44+X44))))))))","v":""},null,null,null,null,{"$f":"IF(AC44=\"\",\"\",IF(AC44=\"Off\",\"0\",IF(X44=\"Off\",SUM(AC44),IF(S44=\"Off\",SUM(X44+AC44),IF(N44=\"Off\",SUM(S44+X44+AC44),IF(AR34=\"Off\",SUM(N44+S44+X44+AC44),(SUM(AR34+N44+S44+X44+AC44))))))))","v":""},null,null,null,null,{"$f":"IF(AH44=\"\",\"\",IF(AH44=\"Off\",\"0\",IF(AC44=\"Off\",SUM(AH44),IF(X44=\"Off\",SUM(AC44+AH44),IF(S44=\"Off\",SUM(X44+AC44+AH44),IF(N44=\"Off\",SUM(S44+X44+AC44+AH44),(SUM(N44+S44+X44+AC44+AH44))))))))","v":""},null,null,null,null,{"$f":"IF(AM44=\"\",\"\",IF(AM44=\"Off\",\"0\",IF(AH44=\"Off\",SUM(AM44),IF(AC44=\"Off\",SUM(AH44+AM44),IF(X44=\"Off\",SUM(AC44+AH44+AM44),IF(S44=\"Off\",SUM(X44+AC44+AH44+AM44),(SUM(S44+X44+AC44+AH44+AM44))))))))","v":""}]
["Total Flight Time Today:",null,null,null,null,null,null,null,null,null,null,null,"+",null,null,null,null,"+",null,null,null,null,"+",null,null,null,null,"+",null,null,null,null,"+",null,null,null,null,"+",null,null,null,null,"+"]
["Total Flight Time This 6-Day Period:",null,null,null,null,null,null,null,null,null,null,null,{"$f":"IF(N44=\"\",\"\",IF(N44=\"Off\",\"0\",SUM(M43+N44)))","v":""},null,null,null,null,{"$f":"IF(S44=\"\",\"\",IF(S44=\"Off\",\"0\",SUM(R43+S44)))","v":""},null,null,null,null,{"$f":"IF(X44=\"\",\"\",IF(X44=\"Off\",\"0\",SUM(W43+X44)))","v":""},null,null,null,null,{"$f":"IF(AC44=\"\",\"\",IF(AC44=\"Off\",\"0\",SUM(AB43+AC44)))","v":""},null,null,null,null,{"$f":"IF(AH44=\"\",\"\",IF(AH44=\"Off\",\"0\",SUM(AG43+AH44)))","v":""},null,null,null,null,{"$f":"IF(AM44=\"\",\"\",IF(AM44=\"Off\",\"0\",SUM(AL43+AM44)))","v":""},null,null,null,null,{"$f":"IF(AR44=\"\",\"\",IF(AR44=\"Off\",\"0\",SUM(AQ43+AR44)))","v":""}]
[]
["Max Flight Time:",null,null,null,null,null,8,null,"*Hours",null,null,"Max Duty Day:",null,null,null,null,null,"14:00:00",null,"*Hours",null,null,"Min Rest Period:",null,null,null,null,null,null,"10:00:00",null,"*Hours",null,null,null,"Required Days Off:",null,null,null,null,null,null,"2 Days in 14*"]
[]
["A maximum of",null,null,null,null,42,"* hours flight time may be flown during any consecutive six-day period.    When a pilot accrues ",null,null,null,null,null,null,null,null,null,null,null,null,null,null,null,null,null,null,null,null,null,null,null,null,null,null,null,null,36,"* or more flight hours in a "]
["consecutive six-day period, the pilot will be given the following full calendar day off-duty.  Following any day-off, a new six-day cycle begins with 0 cumulative flight time."]
[]
[]
["*DOI and USFS Standards.  Other Agency Standards may vary."]

{"sheet":"HCM-13 Driver Sample","index":7,"n_rows":39,"n_cols":43,"rows_kept":39,"cut":false,"hidden":false,"merged":[[25,17,25,21],[25,12,25,16],[25,0,25,11],[28,12,28,16],[23,0,23,46],[24,22,24,26],[24,17,24,21],[24,12,24,16],[24,0,24,11],[24,42,24,46],[24,37,24,41],[24,32,24,36],[24,27,24,31],[28,32,28,36],[28,27,28,31],[28,22,28,26],[28,17,28,21],[38,0,38,46],[29,42,29,46],[29,37,29,41],[29,32,29,36],[29,27,29,31],[29,22,29,26],[29,17,29,21],[29,12,29,16],[29,0,29,11],[31,17,31,21],[32,0,32,46],[36,0,36,46],[35,0,35,46],[34,0,34,46],[31,8,31,10],[31,11,31,16],[2,0,2,46],[9,0,9,46],[6,13,6,16],[6,18,6,21],[6,43,6,46],[4,42,4,46],[28,0,28,11],[27,43,27,46],[27,38,27,41],[27,33,27,36],[27,28,27,31],[27,23,27,26],[27,18,27,21],[27,13,27,16],[28,42,28,46],[28,37,28,41],[25,42,25,46],[25,37,25,41],[25,32,25,36],[25,27,25,31],[3,0,3,11],[4,0,4,11],[4,37,4,41],[3,22,3,26],[1,27,1,36],[1,0,1,7],[1,8,1,26],[7,42,7,46],[7,37,7,41],[7,32,7,36],[7,27,7,31],[8,0,8,11],[8,12,8,16],[8,17,8,21],[8,22,8,26],[5,42,5,46],[6,0,6,11],[5,0,5,11],[5,12,5,16],[6,33,6,36],[6,38,6,41],[3,27,3,31],[6,23,6,26],[6,28,6,31],[5,17,5,21],[5,22,5,26],[3,12,3,16],[3,37,3,41],[3,42,3,46],[4,12,4,16],[4,17,4,21],[4,22,4,26],[4,27,4,31],[4,32,4,36],[10,17,10,21],[10,22,10,26],[10,27,10,31],[10,32,10,36],[10,37,10,41],[10,42,10,46],[8,27,8,31],[8,32,8,36],[8,37,8,41],[5,37,5,41],[5,32,5,36],[5,27,5,31],[8,42,8,46],[3,32,3,36],[3,17,3,21],[10,0,10,11],[10,12,10,16],[31,22,31,28],[31,42,31,46],[31,35,31,41],[16,0,16,46],[27,0,27,11],[26,42,26,46],[26,37,26,41],[26,32,26,36],[26,27,26,31],[26,22,26,26],[26,17,26,21],[26,12,26,16],[26,0,26,11],[11,27,11,31],[11,32,11,36],[11,37,11,41],[12,0,12,11],[12,12,12,16],[12,17,12,21],[25,22,25,26],[12,22,12,26],[12,27,12,31],[12,32,12,36],[12,37,12,41],[11,0,11,11],[11,12,11,16],[11,17,11,21],[11,22,11,26],[12,42,12,46],[11,42,11,46],[13,0,13,11],[13,18,13,21],[13,23,13,26],[13,28,13,31],[13,13,13,16],[13,33,13,36],[13,38,13,41],[13,43,13,46],[15,27,15,31],[15,32,15,36],[15,37,15,41],[15,42,15,46],[15,0,15,11],[15,12,15,16],[15,17,15,21],[15,22,15,26],[14,27,14,31],[14,32,14,36],[14,37,14,41],[14,42,14,46],[14,0,14,11],[14,12,14,16],[14,17,14,21],[14,22,14,26],[20,0,20,11],[20,13,20,16],[20,18,20,21],[20,23,20,26],[17,27,17,31],[17,32,17,36],[17,37,17,41],[17,42,17,46],[17,0,17,11],[17,12,17,16],[17,17,17,21],[17,22,17,26],[18,17,18,21],[18,22,18,26],[18,37,18,41],[18,42,18,46],[19,0,19,11],[18,27,18,31],[18,32,18,36],[18,0,18,11],[18,12,18,16],[0,0,0,38],[0,39,0,46],[31,29,31,34],[33,0,33,46],[7,22,7,26],[7,17,7,21],[7,12,7,16],[7,0,7,11],[22,27,22,31],[22,32,22,36],[21,27,21,31],[21,32,21,36],[21,37,21,41],[21,42,21,46],[21,0,21,11],[21,12,21,16],[21,17,21,21],[21,22,21,26],[20,28,20,31],[20,33,20,36],[1,37,1,46],[22,37,22,41],[22,42,22,46],[22,0,22,11],[22,12,22,16],[22,17,22,21],[22,22,22,26],[19,27,19,31],[19,32,19,36],[19,37,19,41],[19,42,19,46],[20,38,20,41],[20,43,20,46],[19,12,19,16],[19,17,19,21],[19,22,19,26]]}
[{"$f":"'Contract Info'!A1:G1","v":"SuperManager v3.23 SEKI"}]
["Driver Name: ",null,null,null,null,null,null,null,"Mini Driver",null,null,null,null,null,null,null,null,null,null,null,null,null,null,null,null,null,null,"Last Date(s) Off-Duty:"]
[]
["Insert Dates of Next 7 Days:",null,null,null,null,null,null,null,null,null,null,null,null,null,null,null,null,{"$f":"M4+1","v":"1900-01-01"},null,null,null,null,{"$f":"R4+1","v":"1900-01-02"},null,null,null,null,{"$f":"W4+1","v":"1900-01-03"},null,null,null,null,{"$f":"AB4+1","v":"1900-01-04"},null,null,null,null,{"$f":"AG4+1","v":"1900-01-05"},null,null,null,null,{"$f":"AL4+1","v":"1900-01-06"}]
["Actual On-Duty  Time "]
["Actual Off-Duty  Time "]
[]
[]
[]
[]
["Insert Dates of Next 7 Days:",null,null,null,null,null,null,null,null,null,null,null,{"$f":"AQ4+1","v":"1900-01-07"},null,null,null,null,{"$f":"M11+1","v":"1900-01-08"},null,null,null,null,{"$f":"R11+1","v":"1900-01-09"},null,null,null,null,{"$f":"W11+1","v":"1900-01-10"},null,null,null,null,{"$f":"AB11+1","v":"1900-01-11"},null,null,null,null,{"$f":"AG11+1","v":"1900-01-12"},null,null,null,null,{"$f":"AL11+1","v":"1900-01-13"}]
["Actual On-Duty  Time "]
["Actual Off-Duty  Time "]
[]
[]
[]
[]
["Insert Dates of Next 7 Days:",null,null,null,null,null,null,null,null,null,null,null,{"$f":"AQ11+1","v":"1900-01-14"},null,null,null,null,{"$f":"M18+1","v":"1900-01-15"},null,null,null,null,{"$f":"R18+1","v":"1900-01-16"},null,null,null,null,{"$f":"W18+1","v":"1900-01-17"},null,null,null,null,{"$f":"AB18+1","v":"1900-01-18"},null,null,null,null,{"$f":"AG18+1","v":"1900-01-19"},null,null,null,null,{"$f":"AL18+1","v":"1900-01-20"}]
["Actual On-Duty  Time "]
["Actual Off-Duty  Time "]
[]
[]
[]
[]
["Insert Dates of Next 7 Days:",null,null,null,null,null,null,null,null,null,null,null,{"$f":"AQ18+1","v":"1900-01-21"},null,null,null,null,{"$f":"M25+1","v":"1900-01-22"},null,null,null,null,{"$f":"R25+1","v":"1900-01-23"},null,null,null,null,{"$f":"W25+1","v":"1900-01-24"},null,null,null,null,{"$f":"AB25+1","v":"1900-01-25"},null,null,null,null,{"$f":"AG25+1","v":"1900-01-26"},null,null,null,null,{"$f":"AL25+1","v":"1900-01-27"}]
["Actual On-Duty  Time "]
["Actual Off-Duty  Time "]
[]
[]
[]
[]
[null,null,null,null,null,null,null,null,null,null,null,"Max Duty Day:",null,null,null,null,null,"per DOT",null,null,null,null,"Min Rest Period:",null,null,null,null,null,null," per DOT",null,null,null,null,null,"Required Days Off:",null,null,null,null,null,null,"2 Days in 14*"]
[]
["It is the Contractors’ responsibility to insure that employees comply with DOT Safety Regulation 49 CFR Part 390-399, including duty limitations.  The fuel "]
["servicing vehicle driver will be responsible to keep the Government apprised of their ground duty limitation status.  Notwithstanding DOT Safety Regulation"]
["49 CFR Part 390-399, the fuel servicing vehicle driver shall have a minimum of two (2) full calendar days off duty during any 14-day period.  Off duty days "]
[" need not be consecutive."]
[]
["*DOI and USFS Standards.  Other Agency Standards may vary."]

{"sheet":"HCM-14 Mechanic Duty Mechando","index":8,"n_rows":38,"n_cols":44,"rows_kept":38,"cut":false,"hidden":false,"merged":[[34,0,35,46],[37,0,37,46],[31,31,31,34],[31,35,31,41],[31,42,31,46],[32,0,32,46],[33,0,33,4],[33,6,33,34],[33,36,33,46],[31,8,31,10],[31,11,31,16],[31,17,31,18],[31,19,31,21],[31,22,31,28],[31,29,31,30],[28,37,28,41],[28,42,28,46],[29,0,29,11],[29,12,29,16],[29,17,29,21],[29,22,29,26],[29,27,29,31],[29,32,29,36],[29,37,29,41],[29,42,29,46],[28,0,28,11],[28,12,28,16],[28,17,28,21],[28,22,28,26],[28,27,28,31],[28,32,28,36],[27,0,27,11],[27,13,27,16],[27,18,27,21],[27,23,27,26],[27,28,27,31],[27,33,27,36],[27,38,27,41],[27,43,27,46],[26,0,26,11],[26,12,26,16],[26,17,26,21],[26,22,26,26],[26,27,26,31],[26,32,26,36],[25,0,25,11],[25,12,25,16],[25,17,25,21],[25,22,25,26],[25,27,25,31],[25,32,25,36],[25,37,25,41],[25,42,25,46],[26,37,26,41],[26,42,26,46],[22,37,22,41],[22,42,22,46],[23,0,23,46],[24,0,24,11],[24,12,24,16],[24,17,24,21],[24,22,24,26],[24,27,24,31],[24,32,24,36],[24,37,24,41],[22,0,22,11],[22,12,22,16],[22,17,22,21],[22,22,22,26],[22,27,22,31],[22,32,22,36],[24,42,24,46],[20,38,20,41],[20,43,20,46],[21,0,21,11],[21,12,21,16],[21,17,21,21],[21,22,21,26],[21,27,21,31],[21,32,21,36],[21,37,21,41],[21,42,21,46],[20,0,20,11],[20,13,20,16],[20,18,20,21],[20,23,20,26],[20,28,20,31],[20,33,20,36],[18,37,18,41],[18,42,18,46],[19,0,19,11],[19,12,19,16],[19,17,19,21],[19,22,19,26],[19,27,19,31],[19,32,19,36],[19,37,19,41],[19,42,19,46],[18,0,18,11],[18,12,18,16],[18,17,18,21],[18,22,18,26],[18,27,18,31],[18,32,18,36],[16,0,16,46],[17,0,17,11],[17,12,17,16],[17,17,17,21],[17,22,17,26],[17,27,17,31],[17,32,17,36],[17,37,17,41],[17,42,17,46],[14,37,14,41],[14,42,14,46],[15,0,15,11],[15,12,15,16],[15,17,15,21],[15,22,15,26],[15,27,15,31],[15,32,15,36],[15,37,15,41],[15,42,15,46],[14,0,14,11],[14,12,14,16],[14,17,14,21],[14,22,14,26],[14,27,14,31],[14,32,14,36],[13,0,13,11],[13,13,13,16],[13,18,13,21],[13,23,13,26],[13,28,13,31],[13,33,13,36],[13,38,13,41],[13,43,13,46],[12,0,12,11],[12,12,12,16],[12,17,12,21],[12,22,12,26],[12,27,12,31],[12,32,12,36],[11,0,11,11],[11,12,11,16],[11,17,11,21],[11,22,11,26],[11,27,11,31],[11,32,11,36],[11,37,11,41],[11,42,11,46],[12,37,12,41],[12,42,12,46],[8,37,8,41],[8,42,8,46],[9,0,9,46],[10,0,10,11],[10,12,10,16],[10,17,10,21],[10,22,10,26],[10,27,10,31],[10,32,10,36],[10,37,10,41],[8,0,8,11],[8,12,8,16],[8,17,8,21],[8,22,8,26],[8,27,8,31],[8,32,8,36],[10,42,10,46],[6,38,6,41],[6,43,6,46],[7,0,7,11],[7,12,7,16],[7,17,7,21],[7,22,7,26],[7,27,7,31],[7,32,7,36],[7,37,7,41],[7,42,7,46],[6,0,6,11],[6,13,6,16],[6,18,6,21],[6,23,6,26],[6,28,6,31],[6,33,6,36],[4,37,4,41],[4,42,4,46],[5,0,5,11],[5,12,5,16],[5,17,5,21],[5,22,5,26],[5,27,5,31],[5,32,5,36],[5,37,5,41],[5,42,5,46],[4,0,4,11],[4,12,4,16],[4,17,4,21],[4,22,4,26],[4,27,4,31],[4,32,4,36],[0,0,0,38],[0,39,0,46],[1,0,1,7],[1,8,1,26],[1,27,1,36],[1,37,1,46],[2,0,2,46],[3,0,3,11],[3,12,3,16],[3,17,3,21],[3,22,3,26],[3,27,3,31],[3,32,3,36],[3,37,3,41],[3,42,3,46]]}
[{"$f":"'Contract Info'!A1:G1","v":"SuperManager v3.23 SEKI"}]
["Mechanic Name: ",null,null,null,null,null,null,null,"Fernando Mechando",null,null,null,null,null,null,null,null,null,null,null,null,null,null,null,null,null,null,"Last Date(s) Off-Duty:",null,null,null,null,null,null,null,null,null,"5/16&5/17"]
[]
["Insert Dates of Next 7 Days:",null,null,null,null,null,null,null,null,null,null,null,"2022-05-19",null,null,null,null,{"$f":"M4+1","v":"2022-05-20"},null,null,null,null,{"$f":"R4+1","v":"2022-05-21"},null,null,null,null,{"$f":"W4+1","v":"2022-05-22"},null,null,null,null,{"$f":"AB4+1","v":"2022-05-23"},null,null,null,null,{"$f":"AG4+1","v":"2022-05-24"},null,null,null,null,{"$f":"AL4+1","v":"2022-05-25"}]
["Earliest Mechanic Can Be On-Duty:",null,null,null,null,null,null,null,null,null,null,null,"04:00:00",null,null,null,null,{"$f":"IF(M9=\"\",\"\",SUM(M9+$AD$32))","v":1.0208333333333333},null,null,null,null,{"$f":"IF(R9=\"\",\"\",SUM(R9+$AD$32))","v":""},null,null,null,null,{"$f":"IF(W9=\"\",\"\",SUM(W9+$AD$32))","v":""},null,null,null,null,{"$f":"IF(AB9=\"\",\"\",SUM(AB9+$AD$32))","v":""},null,null,null,null,{"$f":"IF(AG9=\"\",\"\",SUM(AG9+$AD$32))","v":""},null,null,null,null,{"$f":"IF(AL9=\"\",\"\",SUM(AL9+$AD$32))","v":""}]
["Actual On-Duty Time (Including Preflight)",null,null,null,null,null,null,null,null,null,null,null,"07:30:00"]
["Add 14 Hours For Maximum Duty Day",null,null,null,null,null,null,null,null,null,null,null,"+",{"$f":"$R$32","v":"16:00:00"},null,null,null,"+",{"$f":"$R$32","v":"16:00:00"},null,null,null,"+",{"$f":"$R$32","v":"16:00:00"},null,null,null,"+",{"$f":"$R$32","v":"16:00:00"},null,null,null,"+",{"$f":"$R$32","v":"16:00:00"},null,null,null,"+",{"$f":"$R$32","v":"16:00:00"},null,null,null,"+",{"$f":"$R$32","v":"16:00:00"}]
["Must Be Off-Duty At:",null,null,null,null,null,null,null,null,null,null,null,{"$f":"IF(M6=\"Off\",\"off\",IF(M6=\"\",\"\",SUM(M6+N7)))","v":"23:30:00"},null,null,null,null,{"$f":"IF(R6=\"Off\",\"off\",IF(R6=\"\",\"\",SUM(R6+S7)))","v":""},null,null,null,null,{"$f":"IF(W6=\"Off\",\"off\",IF(W6=\"\",\"\",SUM(W6+X7)))","v":""},null,null,null,null,{"$f":"IF(AB6=\"Off\",\"off\",IF(AB6=\"\",\"\",SUM(AB6+AC7)))","v":""},null,null,null,null,{"$f":"IF(AG6=\"Off\",\"off\",IF(AG6=\"\",\"\",SUM(AG6+AH7)))","v":""},null,null,null,null,{"$f":"IF(AL6=\"Off\",\"off\",IF(AL6=\"\",\"\",SUM(AL6+AM7)))","v":""},null,null,null,null,{"$f":"IF(AQ6=\"Off\",\"off\",IF(AQ6=\"\",\"\",SUM(AQ6+AR7)))","v":""}]
["Actual Off-Duty Time:",null,null,null,null,null,null,null,null,null,null,null,"16:30:00"]
[]
["Insert Dates of Next 7 Days:",null,null,null,null,null,null,null,null,null,null,null,{"$f":"AQ4+1","v":"2022-05-26"},null,null,null,null,{"$f":"M11+1","v":"2022-05-27"},null,null,null,null,{"$f":"R11+1","v":"2022-05-28"},null,null,null,null,{"$f":"W11+1","v":"2022-05-29"},null,null,null,null,{"$f":"AB11+1","v":"2022-05-30"},null,null,null,null,{"$f":"AG11+1","v":"2022-05-31"},null,null,null,null,{"$f":"AL11+1","v":"2022-06-01"}]
["Earliest Mechanic Can Be On-Duty:",null,null,null,null,null,null,null,null,null,null,null,{"$f":"IF(AQ9=\"\",\"\",SUM(AQ9+$AD$32))","v":""},null,null,null,null,{"$f":"IF(M16=\"\",\"\",SUM(M16+$AD$32))","v":""},null,null,null,null,{"$f":"IF(R16=\"\",\"\",SUM(R16+$AD$32))","v":""},null,null,null,null,{"$f":"IF(W16=\"\",\"\",SUM(W16+$AD$32))","v":""},null,null,null,null,{"$f":"IF(AB16=\"\",\"\",SUM(AB16+$AD$32))","v":""},null,null,null,null,{"$f":"IF(AG16=\"\",\"\",SUM(AG16+$AD$32))","v":""},null,null,null,null,{"$f":"IF(AL16=\"\",\"\",SUM(AL16+$AD$32))","v":""}]
["Actual On-Duty Time (Including Preflight)"]
["Add 14 Hours For Maximum Duty Day",null,null,null,null,null,null,null,null,null,null,null,"+",{"$f":"$R$32","v":"16:00:00"},null,null,null,"+",{"$f":"$R$32","v":"16:00:00"},null,null,null,"+",{"$f":"$R$32","v":"16:00:00"},null,null,null,"+",{"$f":"$R$32","v":"16:00:00"},null,null,null,"+",{"$f":"$R$32","v":"16:00:00"},null,null,null,"+",{"$f":"$R$32","v":"16:00:00"},null,null,null,"+",{"$f":"$R$32","v":"16:00:00"}]
["Must Be Off-Duty At:",null,null,null,null,null,null,null,null,null,null,null,{"$f":"IF(M13=\"Off\",\"off\",IF(M13=\"\",\"\",SUM(M13+N14)))","v":""},null,null,null,null,{"$f":"IF(R13=\"Off\",\"off\",IF(R13=\"\",\"\",SUM(R13+S14)))","v":""},null,null,null,null,{"$f":"IF(W13=\"Off\",\"off\",IF(W13=\"\",\"\",SUM(W13+X14)))","v":""},null,null,null,null,{"$f":"IF(AB13=\"Off\",\"off\",IF(AB13=\"\",\"\",SUM(AB13+AC14)))","v":""},null,null,null,null,{"$f":"IF(AG13=\"Off\",\"off\",IF(AG13=\"\",\"\",SUM(AG13+AH14)))","v":""},null,null,null,null,{"$f":"IF(AL13=\"Off\",\"off\",IF(AL13=\"\",\"\",SUM(AL13+AM14)))","v":""},null,null,null,null,{"$f":"IF(AQ13=\"Off\",\"off\",IF(AQ13=\"\",\"\",SUM(AQ13+AR14)))","v":""}]
["Actual Off-Duty Time:"]
[]
["Insert Dates of Next 7 Days:",null,null,null,null,null,null,null,null,null,null,null,{"$f":"AQ11+1","v":"2022-06-02"},null,null,null,null,{"$f":"M18+1","v":"2022-06-03"},null,null,null,null,{"$f":"R18+1","v":"2022-06-04"},null,null,null,null,{"$f":"W18+1","v":"2022-06-05"},null,null,null,null,{"$f":"AB18+1","v":"2022-06-06"},null,null,null,null,{"$f":"AG18+1","v":"2022-06-07"},null,null,null,null,{"$f":"AL18+1","v":"2022-06-08"}]
["Earliest Mechanic Can Be On-Duty:",null,null,null,null,null,null,null,null,null,null,null,{"$f":"IF(AQ16=\"\",\"\",SUM(AQ16+$AD$32))","v":""},null,null,null,null,{"$f":"IF(M23=\"\",\"\",SUM(M23+$AD$32))","v":""},null,null,null,null,{"$f":"IF(R23=\"\",\"\",SUM(R23+$AD$32))","v":""},null,null,null,null,{"$f":"IF(W23=\"\",\"\",SUM(W23+$AD$32))","v":""},null,null,null,null,{"$f":"IF(AB23=\"\",\"\",SUM(AB23+$AD$32))","v":""},null,null,null,null,{"$f":"IF(AG23=\"\",\"\",SUM(AG23+$AD$32))","v":""},null,null,null,null,{"$f":"IF(AL23=\"\",\"\",SUM(AL23+$AD$32))","v":""}]
["Actual On-Duty Time (Including Preflight)"]
["Add 14 Hours For Maximum Duty Day",null,null,null,null,null,null,null,null,null,null,null,"+",{"$f":"$R$32","v":"16:00:00"},null,null,null,"+",{"$f":"$R$32","v":"16:00:00"},null,null,null,"+",{"$f":"$R$32","v":"16:00:00"},null,null,null,"+",{"$f":"$R$32","v":"16:00:00"},null,null,null,"+",{"$f":"$R$32","v":"16:00:00"},null,null,null,"+",{"$f":"$R$32","v":"16:00:00"},null,null,null,"+",{"$f":"$R$32","v":"16:00:00"}]
["Must Be Off-Duty At:",null,null,null,null,null,null,null,null,null,null,null,{"$f":"IF(M20=\"Off\",\"off\",IF(M20=\"\",\"\",SUM(M20+N21)))","v":""},null,null,null,null,{"$f":"IF(R20=\"Off\",\"off\",IF(R20=\"\",\"\",SUM(R20+S21)))","v":""},null,null,null,null,{"$f":"IF(W20=\"Off\",\"off\",IF(W20=\"\",\"\",SUM(W20+X21)))","v":""},null,null,null,null,{"$f":"IF(AB20=\"Off\",\"off\",IF(AB20=\"\",\"\",SUM(AB20+AC21)))","v":""},null,null,null,null,{"$f":"IF(AG20=\"Off\",\"off\",IF(AG20=\"\",\"\",SUM(AG20+AH21)))","v":""},null,null,null,null,{"$f":"IF(AL20=\"Off\",\"off\",IF(AL20=\"\",\"\",SUM(AL20+AM21)))","v":""},null,null,null,null,{"$f":"IF(AQ20=\"Off\",\"off\",IF(AQ20=\"\",\"\",SUM(AQ20+AR21)))","v":""}]
["Actual Off-Duty Time:"]
[]
["Insert Dates of Next 7 Days:",null,null,null,null,null,null,null,null,null,null,null,{"$f":"AQ18+1","v":"2022-06-09"},null,null,null,null,{"$f":"M25+1","v":"2022-06-10"},null,null,null,null,{"$f":"R25+1","v":"2022-06-11"},null,null,null,null,{"$f":"W25+1","v":"2022-06-12"},null,null,null,null,{"$f":"AB25+1","v":"2022-06-13"},null,null,null,null,{"$f":"AG25+1","v":"2022-06-14"},null,null,null,null,{"$f":"AL25+1","v":"2022-06-15"}]
["Earliest Mechanic Can Be On-Duty:",null,null,null,null,null,null,null,null,null,null,null,{"$f":"IF(AQ23=\"\",\"\",SUM(AQ23+$AD$32))","v":""},null,null,null,null,{"$f":"IF(M30=\"\",\"\",SUM(M30+$AD$32))","v":""},null,null,null,null,{"$f":"IF(R30=\"\",\"\",SUM(R30+$AD$32))","v":""},null,null,null,null,{"$f":"IF(W30=\"\",\"\",SUM(W30+$AD$32))","v":""},null,null,null,null,{"$f":"IF(AB30=\"\",\"\",SUM(AB30+$AD$32))","v":""},null,null,null,null,{"$f":"IF(AG30=\"\",\"\",SUM(AG30+$AD$32))","v":""},null,null,null,null,{"$f":"IF(AL30=\"\",\"\",SUM(AL30+$AD$32))","v":""}]
["Actual On-Duty Time (Including Preflight)"]
["Add 14 Hours For Maximum Duty Day",null,null,null,null,null,null,null,null,null,null,null,"+",{"$f":"$R$32","v":"16:00:00"},null,null,null,"+",{"$f":"$R$32","v":"16:00:00"},null,null,null,"+",{"$f":"$R$32","v":"16:00:00"},null,null,null,"+",{"$f":"$R$32","v":"16:00:00"},null,null,null,"+",{"$f":"$R$32","v":"16:00:00"},null,null,null,"+",{"$f":"$R$32","v":"16:00:00"},null,null,null,"+",{"$f":"$R$32","v":"16:00:00"}]
["Must Be Off-Duty At:",null,null,null,null,null,null,null,null,null,null,null,{"$f":"IF(M27=\"Off\",\"off\",IF(M27=\"\",\"\",SUM(M27+N28)))","v":""},null,null,null,null,{"$f":"IF(R27=\"Off\",\"off\",IF(R27=\"\",\"\",SUM(R27+S28)))","v":""},null,null,null,null,{"$f":"IF(W27=\"Off\",\"off\",IF(W27=\"\",\"\",SUM(W27+X28)))","v":""},null,null,null,null,{"$f":"IF(AB27=\"Off\",\"off\",IF(AB27=\"\",\"\",SUM(AB27+AC28)))","v":""},null,null,null,null,{"$f":"IF(AG27=\"Off\",\"off\",IF(AG27=\"\",\"\",SUM(AG27+AH28)))","v":""},null,null,null,null,{"$f":"IF(AL27=\"Off\",\"off\",IF(AL27=\"\",\"\",SUM(AL27+AM28)))","v":""},null,null,null,null,{"$f":"IF(AQ27=\"Off\",\"off\",IF(AQ27=\"\",\"\",SUM(AQ27+AR28)))","v":""}]
["Actual Off-Duty Time:"]
[]
[null,null,null,null,null,null,null,null,null,null,null,"Max Duty Day:",null,null,null,null,null,"16:00:00",null,"*Hours",null,null,"Min Rest Period:",null,null,null,null,null,null,"08:00:00",null,"*Hours",null,null,null,"Required Days Off:",null,null,null,null,null,null,"2 Days in 14*"]
[]
[]
[]
[]
[]
["*DOI and USFS Standards.  Other Agency Standards may vary."]

{"sheet":"HCM-2-Pre-Use Checklist","index":9,"n_rows":56,"n_cols":34,"rows_kept":56,"cut":false,"hidden":false,"merged":[[3,0,3,2],[3,3,3,24],[3,25,3,30],[3,31,3,34],[4,0,4,5],[4,6,4,20],[4,21,4,34],[0,0,0,34],[1,0,1,34],[2,0,2,2],[2,3,2,6],[2,7,2,13],[2,14,2,25],[2,26,2,27],[2,28,2,34],[5,0,5,7],[5,8,5,20],[5,21,5,34],[6,0,6,12],[6,13,6,14],[6,15,6,16],[6,17,6,18],[6,19,6,20],[6,21,6,26],[6,27,6,28],[8,0,8,5],[8,6,8,15],[8,16,8,21],[8,22,8,25],[8,26,8,30],[8,31,8,34],[6,29,6,30],[6,31,6,32],[6,33,6,34],[7,0,7,8],[7,9,7,14],[7,15,7,26],[7,27,7,28],[7,29,7,30],[7,31,7,32],[7,33,7,34],[9,27,9,28],[9,29,9,30],[9,31,9,32],[9,33,9,34],[11,0,11,34],[12,0,12,26],[12,27,12,28],[12,29,12,30],[12,31,12,32],[12,33,12,34],[9,0,9,10],[9,11,9,12],[9,13,9,14],[9,15,9,16],[9,17,9,18],[9,19,9,26],[15,0,15,26],[15,27,15,28],[15,29,15,30],[15,31,15,32],[15,33,15,34],[16,0,16,4],[16,5,16,34],[13,0,13,26],[13,27,13,28],[13,29,13,30],[13,31,13,32],[13,33,13,34],[14,0,14,26],[14,27,14,28],[14,29,14,30],[14,31,14,32],[14,33,14,34],[22,0,22,6],[22,7,22,8],[22,9,22,34],[23,0,23,6],[23,7,23,8],[23,9,23,34],[17,0,17,34],[19,0,19,34],[20,0,20,6],[20,7,20,8],[20,9,20,34],[21,0,21,6],[21,7,21,8],[21,9,21,34],[26,0,26,6],[26,7,26,8],[26,9,26,34],[27,0,27,6],[27,7,27,8],[27,9,27,34],[24,0,24,6],[24,7,24,8],[24,9,24,34],[25,0,25,6],[25,7,25,8],[25,9,25,34],[32,0,32,34],[33,0,33,12],[33,13,33,14],[33,15,33,16],[33,17,33,30],[33,31,33,32],[33,33,33,34],[28,0,28,6],[28,7,28,8],[28,9,28,34],[29,0,29,4],[29,5,29,34],[30,0,30,34],[35,0,35,12],[35,13,35,14],[35,15,35,16],[35,17,35,30],[35,31,35,32],[35,33,35,34],[34,0,34,12],[34,13,34,14],[34,15,34,16],[34,17,34,30],[34,31,34,32],[34,33,34,34],[37,0,37,12],[37,13,37,14],[37,15,37,16],[37,17,37,30],[37,31,37,32],[37,33,37,34],[36,0,36,12],[36,13,36,14],[36,15,36,16],[36,17,36,30],[36,31,36,32],[36,33,36,34],[39,0,39,12],[39,13,39,14],[39,15,39,16],[39,17,39,30],[39,31,39,32],[39,33,39,34],[38,0,38,12],[38,13,38,14],[38,15,38,16],[38,17,38,30],[38,31,38,32],[38,33,38,34],[41,0,41,12],[41,13,41,14],[41,15,41,16],[41,17,41,30],[41,31,41,32],[41,33,41,34],[40,0,40,12],[40,13,40,14],[40,15,40,16],[40,17,40,30],[40,31,40,32],[40,33,40,34],[42,0,42,4],[42,5,42,34],[43,0,43,34],[45,0,45,34],[46,0,46,12],[46,13,46,14],[46,15,46,16],[46,17,46,30],[46,31,46,32],[46,33,46,34],[48,0,48,12],[48,13,48,14],[48,15,48,16],[48,17,48,30],[48,31,48,32],[48,33,48,34],[47,0,47,12],[47,13,47,14],[47,15,47,16],[47,17,47,30],[47,31,47,32],[47,33,47,34],[50,0,50,12],[50,13,50,14],[50,15,50,16],[50,17,50,30],[50,31,50,32],[50,33,50,34],[49,0,49,12],[49,13,49,14],[49,15,49,16],[49,17,49,30],[49,31,49,32],[49,33,49,34],[56,0,56,19],[56,20,56,30],[56,31,56,34],[57,0,57,19],[57,20,57,30],[57,31,57,34],[51,0,51,9],[51,10,51,34],[52,0,52,4],[52,5,52,34],[53,0,53,34],[55,0,55,19],[55,20,55,30],[55,31,55,34]]}
[{"$f":"'Contract Info'!A1:G1","v":"SuperManager v3.23 SEKI"}]
["General"]
["Date:",null,null,"2021-05-02",null,null,null,"Aircraft Make/Model:",null,null,null,null,null,null,{"$f":"'Contract Info'!D4","v":"Airbus H-125"},null,null,null,null,null,null,null,null,null,null,null,"N#:",null,{"$f":"'Contract Info'!D3","v":"N836TJ"}]
["Vendor:",null,null,{"$f":"'Contract Info'!D8:F8","v":"Butterfly Airways, Inc."},null,null,null,null,null,null,null,null,null,null,null,null,null,null,null,null,null,null,null,null,null,"Equipped Weight:",null,null,null,null,null,{"$f":"'Contract Info'!D32","v":0}]
["Pilot(s) Name(s):"]
["Card Expiration Date(s):"]
["Pilot(s) Carded for Intended Mission(s):",null,null,null,null,null,null,null,null,null,null,null,null,"Yes:",null,null,null,"No:",null,null,null,"Mech",null,null,null,null,null,"Yes:",null,null,null,"No:"]
["A/C Card Expiration Date:",null,null,null,null,null,null,null,null,null,null,null,null,null,null,"A/C Carded For Intended Mission(s):",null,null,null,null,null,null,null,null,null,null,null,"Yes:",null,null,null,"No:"]
["Departure Base:",null,null,null,null,null,null,null,null,null,null,null,null,null,null,null,"Departure HOBBS:",null,null,null,null,null,null,null,null,null,"Arrival HOBBS:"]
["Copy Of Contract Onboard A/C:",null,null,null,null,null,null,null,null,null,null,"Yes:",null,null,null,"No:",null,null,null,"HazMat HB/Exemption/ERG:",null,null,null,null,null,null,null,"Yes:",null,null,null,"No:"]
[]
["Logbook Review"]
["50/100-Hour, Progressive, Or Other Inspection Program Up-To-Date:",null,null,null,null,null,null,null,null,null,null,null,null,null,null,null,null,null,null,null,null,null,null,null,null,null,null,"Yes:",null,null,null,"No:"]
["Entries Indicating Damage to Aircraft:",null,null,null,null,null,null,null,null,null,null,null,null,null,null,null,null,null,null,null,null,null,null,null,null,null,null,"Yes:",null,null,null,"No:"]
["Form HCM-5 \"Turbine Engine Performance Analysis\" Onboard Aircraft:",null,null,null,null,null,null,null,null,null,null,null,null,null,null,null,null,null,null,null,null,null,null,null,null,null,null,"Yes:",null,null,null,"No:"]
["Power Check Completed/Results Satisfactory:",null,null,null,null,null,null,null,null,null,null,null,null,null,null,null,null,null,null,null,null,null,null,null,null,null,null,"Yes:",null,null,null,"No:"]
["Comments:"]
[]
[]
["Condition Of Helicopter"]
["Item",null,null,null,null,null,null,"OK",null,"Document Inoperable Or Damaged Equipment (Dents, Tears, Leaks, Etc.)"]
["Skin and Exterior"]
["Windows"]
["Doors"]
["Upholstery"]
["Cargo Compartment"]
["Skids/Wheels"]
["Fixed Tank"]
["Other"]
["Comments:"]
[]
[]
["Required Helicopter Equipment Installed And Operative (Consult Contract)"]
["Item",null,null,null,null,null,null,null,null,null,null,null,null,"Yes",null,"No",null,"Item",null,null,null,null,null,null,null,null,null,null,null,null,null,"Yes",null,"No"]
["Seat Belts And Harnesses",null,null,null,null,null,null,null,null,null,null,null,null,null,null,null,null,"Strobe Light(s)"]
["Hi-Visibility Paint On Main Rotor Blades",null,null,null,null,null,null,null,null,null,null,null,null,null,null,null,null,"Survival Kit"]
["9600 Channel Radio",null,null,null,null,null,null,null,null,null,null,null,null,null,null,null,null,"First Aid Kit"]
["VHF-AM 720-Channel Radio",null,null,null,null,null,null,null,null,null,null,null,null,null,null,null,null,"Fire Extinguisher(s)"]
["Auxiliary Radio Adapter",null,null,null,null,null,null,null,null,null,null,null,null,null,null,null,null,"Cargo Hook"]
["GPS",null,null,null,null,null,null,null,null,null,null,null,null,null,null,null,null,"Convex Mirror"]
["High Skid Gear",null,null,null,null,null,null,null,null,null,null,null,null,null,null,null,null,"Buckets (Appropriate Sizes)"]
["Nine-Pin Plug (Type III Helicopters Only)",null,null,null,null,null,null,null,null,null,null,null,null,null,null,null,null,"Anti-Theft Security Measures in Place"]
["Comments:"]
[]
[]
["Required Service Truck Equipment Installed And Operative (Consult Contract)"]
["Item",null,null,null,null,null,null,null,null,null,null,null,null,"Yes",null,"No",null,"Item",null,null,null,null,null,null,null,null,null,null,null,null,null,"Yes",null,"No"]
["Spare Set Of Filters",null,null,null,null,null,null,null,null,null,null,null,null,null,null,null,null,"Filter Change Date Placarded"]
["Fire Extinguisher(s)/Current Inspection",null,null,null,null,null,null,null,null,null,null,null,null,null,null,null,null,"Bonding Cables"]
["HazMat Marking And Placards",null,null,null,null,null,null,null,null,null,null,null,null,null,null,null,null,"Fuel Quality Control Log"]
["Inspection Sticker",null,null,null,null,null,null,null,null,null,null,null,null,null,null,null,null,"Absorbent Materials For Spills"]
["Beginning Odometer Reading:"]
["Comments:"]
[]
[]
["Signatures of: Inspecting Govt. Representative & Pilot",null,null,null,null,null,null,null,null,null,null,null,null,null,null,null,null,null,null,null,"Print Name",null,null,null,null,null,null,null,null,null,null,"Date"]

{"sheet":"HCM-4 Power Check","index":10,"n_rows":21,"n_cols":29,"rows_kept":21,"cut":false,"hidden":false,"merged":[[17,0,19,34],[20,0,20,22],[20,23,20,34],[14,0,14,6],[14,7,14,11],[14,12,14,16],[14,17,14,34],[15,0,15,6],[15,7,15,16],[15,17,15,25],[15,26,15,34],[12,0,12,6],[12,7,12,11],[12,12,12,16],[12,17,13,25],[12,26,13,34],[13,0,13,6],[13,7,13,11],[13,12,13,16],[11,17,11,34],[8,0,8,6],[8,7,8,11],[8,12,8,16],[8,17,8,34],[9,0,9,6],[9,7,9,11],[9,12,9,16],[9,17,10,25],[9,26,10,34],[10,0,10,6],[10,7,10,11],[10,12,10,16],[11,0,11,6],[11,7,11,11],[11,12,11,16],[5,0,5,6],[5,7,5,11],[5,12,5,16],[5,17,5,34],[6,0,6,6],[6,7,6,16],[6,17,7,34],[7,0,7,6],[7,7,7,16],[3,0,3,2],[3,3,3,16],[3,17,3,20],[3,21,3,34],[4,0,4,6],[4,7,4,16],[4,17,4,22],[4,23,4,34],[0,0,0,35],[1,0,1,34],[2,0,2,2],[2,3,2,6],[2,7,2,12],[2,13,2,25],[2,26,2,27],[2,28,2,34]]}
[{"$f":"'Contract Info'!A1:G1","v":"SuperManager v3.23 SEKI"}]
["HELICOPTER TURBINE ENGINE POWER CHECK"]
["Date:",null,null,null,null,null,null,"Aircraft Make/Model:",null,null,null,null,null,{"$f":"'Contract Info'!D4","v":"Airbus H-125"},null,null,null,null,null,null,null,null,null,null,null,null,"N#:",null,{"$f":"'Contract Info'!D3","v":"N836TJ"}]
["Pilot:",null,null,null,null,null,null,null,null,null,null,null,null,null,null,null,null,"Vendor:",null,null,null,{"$f":"'Contract Info'!D8","v":"Butterfly Airways, Inc."}]
["*Item",null,null,null,null,null,null,"Value",null,null,null,null,null,null,null,null,null,"HOBBS Meter:"]
["Engine #",null,null,null,null,null,null,"#1",null,null,null,null,"#2",null,null,null,null,"Type of Check:"]
["OAT:",null,null,null,null,null,null,null,null,null,null,null,null,null,null,null,null,"Power Check"]
["PA:"]
["Torque:",null,null,null,null,null,null,null,null,null,null,null,"-",null,null,null,null,"Performance Reading"]
["T.O.T. / T4",null,null,null,null,null,null,null,null,null,null,null,"-",null,null,null,null,0,null,null,null,null,null,null,null,null,0]
["N1/NG:",null,null,null,null,null,null,null,null,null,null,null,"-"]
["N2:",null,null,null,null,null,null,null,null,null,null,null,"-",null,null,null,null,"Chart Reading:"]
["EGT:",null,null,null,null,null,null,null,null,null,null,null,"-",null,null,null,null,0,null,null,null,null,null,null,null,null,0]
["NR",null,null,null,null,null,null,null,null,null,null,null,"-"]
[null,null,null,null,null,null,null,null,null,null,null,null,null,null,null,null,null,"Margin Difference:"]
["Correction Factor:",null,null,null,null,null,null,null,null,null,null,null,null,null,null,null,null,{"$f":"SUM(R10-R13)","v":0},null,null,null,null,null,null,null,null,{"$f":"SUM(AA10-AA13)","v":0}]
[]
[]
[]
[]
["*Use only items applicable to type of helicopter",null,null,null,null,null,null,null,null,null,null,null,null,null,null,null,null,null,null,null,null,null,null,"HCM-4 SuperManager v1.9 *OPTIONAL"]

{"sheet":"HCM-5 Trend Analysis","index":11,"n_rows":37,"n_cols":43,"rows_kept":37,"cut":false,"hidden":false,"merged":[[31,26,31,27],[1,0,1,43],[29,40,29,41],[29,42,29,43],[29,20,29,21],[29,22,29,23],[28,42,28,43],[28,32,28,33],[28,34,28,35],[28,30,28,31],[29,8,29,9],[29,10,29,11],[27,10,27,11],[29,28,29,29],[29,30,29,31],[28,16,28,17],[29,24,29,25],[29,26,29,27],[28,38,28,39],[29,12,29,13],[29,14,29,15],[28,40,28,41],[28,18,28,19],[28,20,28,21],[0,0,0,43],[32,8,32,9],[32,10,32,11],[32,40,32,41],[32,42,32,43],[29,32,29,33],[29,34,29,35],[32,24,32,25],[32,26,32,27],[32,36,32,37],[32,38,32,39],[29,36,29,37],[29,38,29,39],[32,34,32,35],[30,38,30,39],[32,32,32,33],[29,16,29,17],[29,18,29,19],[30,24,30,25],[30,26,30,27],[27,8,27,9],[29,0,29,3],[29,4,29,5],[29,6,29,7],[26,18,26,19],[26,20,26,21],[26,22,26,23],[26,24,26,25],[26,26,26,27],[27,18,27,19],[27,20,27,21],[27,22,27,23],[27,30,27,31],[27,24,27,25],[27,26,27,27],[26,28,26,29],[26,30,26,31],[27,28,27,29],[23,36,23,39],[22,28,22,31],[22,32,22,35],[23,8,23,11],[23,12,23,15],[23,16,23,19],[23,20,23,23],[25,30,25,31],[25,40,25,41],[25,32,25,33],[25,34,25,35],[22,24,22,27],[23,40,23,43],[22,40,22,43],[22,36,22,39],[23,24,23,27],[25,22,25,23],[25,24,25,25],[25,26,25,27],[25,36,25,37],[25,38,25,39],[25,28,25,29],[25,18,25,19],[25,20,25,21],[2,37,2,39],[2,40,2,42],[2,33,2,36],[21,28,21,31],[21,32,21,35],[21,36,21,39],[21,40,21,43],[16,3,16,4],[21,0,21,3],[21,4,21,7],[21,8,21,11],[21,12,21,15],[21,16,21,19],[2,0,2,6],[2,7,2,12],[2,13,2,17],[2,18,2,32],[14,3,14,4],[15,3,15,4],[7,3,7,4],[8,3,8,4],[9,3,9,4],[10,3,10,4],[11,3,11,4],[33,28,33,31],[33,32,33,35],[32,28,32,29],[32,30,32,31],[33,36,33,39],[33,40,33,43],[21,20,21,23],[17,3,17,4],[21,24,21,27],[24,24,24,27],[24,28,24,31],[24,32,24,35],[24,8,24,11],[24,12,24,15],[24,16,24,19],[24,20,24,23],[23,0,23,3],[22,12,22,15],[22,8,22,11],[22,16,22,19],[22,20,22,23],[24,0,24,3],[24,4,24,7],[23,28,23,31],[33,8,33,11],[33,12,33,15],[33,16,33,19],[32,16,32,17],[32,18,32,19],[32,12,32,13],[32,14,32,15],[33,20,33,23],[33,24,33,27],[32,20,32,21],[32,22,32,23],[32,6,32,7],[30,0,30,3],[33,0,33,3],[33,4,33,7],[32,0,32,3],[32,4,32,5],[31,0,31,3],[31,4,31,5],[31,6,31,7],[28,0,28,3],[28,4,28,5],[23,4,23,7],[22,0,22,3],[22,4,22,7],[26,6,26,7],[27,0,27,3],[27,4,27,5],[27,6,27,7],[26,0,26,3],[26,4,26,5],[25,6,25,7],[28,6,28,7],[12,3,12,4],[13,3,13,4],[25,0,25,3],[25,4,25,5],[23,32,23,35],[30,4,30,5],[30,6,30,7],[30,8,30,9],[30,10,30,11],[30,12,30,13],[30,14,30,15],[30,16,30,17],[25,8,25,9],[25,10,25,11],[25,12,25,13],[25,14,25,15],[25,16,25,17],[26,8,26,9],[26,10,26,11],[26,12,26,13],[26,14,26,15],[26,16,26,17],[27,12,27,13],[27,14,27,15],[27,16,27,17],[28,8,28,9],[28,10,28,11],[28,12,28,13],[28,14,28,15],[30,42,30,43],[30,28,30,29],[30,30,30,31],[30,32,30,33],[30,34,30,35],[30,36,30,37],[27,40,27,41],[27,34,27,35],[27,42,27,43],[27,36,27,37],[27,38,27,39],[27,32,27,33],[28,26,28,27],[28,28,28,29],[28,22,28,23],[28,24,28,25],[28,36,28,37],[24,36,24,39],[24,40,24,43],[25,42,25,43],[26,40,26,41],[26,42,26,43],[26,32,26,33],[26,34,26,35],[26,36,26,37],[26,38,26,39],[31,40,31,41],[31,42,31,43],[18,1,18,4],[20,1,20,4],[19,1,19,4],[31,32,31,33],[31,34,31,35],[31,36,31,37],[31,38,31,39],[31,24,31,25],[31,28,31,29],[31,30,31,31],[31,16,31,17],[31,18,31,19],[31,20,31,21],[31,22,31,23],[31,8,31,9],[31,10,31,11],[31,12,31,13],[31,14,31,15],[30,20,30,21],[30,22,30,23],[30,18,30,19],[30,40,30,41]]}
[{"$f":"'Contract Info'!A1:G1","v":"SuperManager v3.23 SEKI"}]
["TURBINE ENGINE PERFORMANCE TREND ANALYSIS"]
["Helicopter N# :",null,null,null,null,null,null,{"$f":"'Contract Info'!D3","v":"N836TJ"},null,null,null,null,null,"Make/Model:",null,null,null,null,{"$f":"'Contract Info'!D4","v":"Airbus H-125"},null,null,null,null,null,null,null,null,null,null,null,null,null,null,"Engines # :",null,null,null,1,null,null,2]
[" >15",null,null,null,null,{"$f":"IF(E$33>1000,\"\",IF(E$33>$A5,\"X\",\"\"))","v":""},{"$f":"IF(G$33>1000,\"\",IF(G$33>$A5,\"X\",\"\"))","v":""},null,null,{"$f":"IF(I$33>1000,\"\",IF(I$33>$A5,\"X\",\"\"))","v":""},{"$f":"IF(K$33>1000,\"\",IF(K$33>$A5,\"X\",\"\"))","v":""},null,null,{"$f":"IF(M$33>1000,\"\",IF(M$33>$A5,\"X\",\"\"))","v":""},{"$f":"IF(O$33>1000,\"\",IF(O$33>$A5,\"X\",\"\"))","v":""},null,null,{"$f":"IF(Q$33>1000,\"\",IF(Q$33>$A5,\"X\",\"\"))","v":""},{"$f":"IF(S$33>1000,\"\",IF(S$33>$A5,\"X\",\"\"))","v":""},null,null,{"$f":"IF(U$33>1000,\"\",IF(U$33>$A5,\"X\",\"\"))","v":""},{"$f":"IF(W$33>1000,\"\",IF(W$33>$A5,\"X\",\"\"))","v":""},null,null,{"$f":"IF(Y$33>1000,\"\",IF(Y$33>$A5,\"X\",\"\"))","v":""},{"$f":"IF(AA$33>1000,\"\",IF(AA$33>$A5,\"X\",\"\"))","v":""},null,null,{"$f":"IF(AC$33>1000,\"\",IF(AC$33>$A5,\"X\",\"\"))","v":""},{"$f":"IF(AE$33>1000,\"\",IF(AE$33>$A5,\"X\",\"\"))","v":""},null,null,{"$f":"IF(AG$33>1000,\"\",IF(AG$33>$A5,\"X\",\"\"))","v":""},{"$f":"IF(AI$33>1000,\"\",IF(AI$33>$A5,\"X\",\"\"))","v":""},null,null,{"$f":"IF(AK$33>1000,\"\",IF(AK$33>$A5,\"X\",\"\"))","v":""},{"$f":"IF(AM$33>1000,\"\",IF(AM$33>$A5,\"X\",\"\"))","v":""},null,null,{"$f":"IF(AO$33>1000,\"\",IF(AO$33>$A5,\"X\",\"\"))","v":""},{"$f":"IF(AQ$33>1000,\"\",IF(AQ$33>$A5,\"X\",\"\"))","v":""}]
[15,null,null,null,null,{"$f":"IF(E$33=$A5,\"X\",\"\")","v":""},{"$f":"IF(G$33=$A5,\"X\",\"\")","v":""},null,null,{"$f":"IF(I$33=$A5,\"X\",\"\")","v":""},{"$f":"IF(K$33=$A5,\"X\",\"\")","v":""},null,null,{"$f":"IF(M$33=$A5,\"X\",\"\")","v":""},{"$f":"IF(O$33=$A5,\"X\",\"\")","v":""},null,null,{"$f":"IF(Q$33=$A5,\"X\",\"\")","v":""},{"$f":"IF(S$33=$A5,\"X\",\"\")","v":""},null,null,{"$f":"IF(U$33=$A5,\"X\",\"\")","v":""},{"$f":"IF(W$33=$A5,\"X\",\"\")","v":""},null,null,{"$f":"IF(Y$33=$A5,\"X\",\"\")","v":""},{"$f":"IF(AA$33=$A5,\"X\",\"\")","v":""},null,null,{"$f":"IF(AC$33=$A5,\"X\",\"\")","v":""},{"$f":"IF(AE$33=$A5,\"X\",\"\")","v":""},null,null,{"$f":"IF(AG$33=$A5,\"X\",\"\")","v":""},{"$f":"IF(AI$33=$A5,\"X\",\"\")","v":""},null,null,{"$f":"IF(AK$33=$A5,\"X\",\"\")","v":""},{"$f":"IF(AM$33=$A5,\"X\",\"\")","v":""},null,null,{"$f":"IF(AO$33=$A5,\"X\",\"\")","v":""},{"$f":"IF(AQ$33=$A5,\"X\",\"\")","v":""}]
[14,null,null,null,null,"","",null,null,"","",null,null,"","",null,null,"","",null,null,"","",null,null,"","",null,null,"","",null,null,"","",null,null,"","",null,null,"",""]
[13,null,null,null,null,"","",null,null,"","",null,null,"","",null,null,"","",null,null,"","",null,null,"","",null,null,"","",null,null,"","",null,null,"","",null,null,"",""]
[12,null,null,null,null,"","",null,null,"","",null,null,"","",null,null,"","",null,null,"","",null,null,"","",null,null,"","",null,null,"","",null,null,"","",null,null,"",""]
[11,null,null,null,null,"","",null,null,"","",null,null,"","",null,null,"","",null,null,"","",null,null,"","",null,null,"","",null,null,"","",null,null,"","",null,null,"",""]
[10,null,null,null,null,"","",null,null,"","",null,null,"","",null,null,"","",null,null,"","",null,null,"","",null,null,"","",null,null,"","",null,null,"","",null,null,"",""]
[9,null,null,null,null,"","",null,null,"","",null,null,"","",null,null,"","",null,null,"","",null,null,"","",null,null,"","",null,null,"","",null,null,"","",null,null,"",""]
[8,null,null,null,null,"","",null,null,"","",null,null,"","",null,null,"","",null,null,"","",null,null,"","",null,null,"","",null,null,"","",null,null,"","",null,null,"",""]
[7,null,null,null,null,"","",null,null,"","",null,null,"","",null,null,"","",null,null,"","",null,null,"","",null,null,"","",null,null,"","",null,null,"","",null,null,"",""]
[6,null,null,null,null,"","",null,null,"","",null,null,"","",null,null,"","",null,null,"","",null,null,"","",null,null,"","",null,null,"","",null,null,"","",null,null,"",""]
[5,null,null,null,null,"","",null,null,"","",null,null,"","",null,null,"","",null,null,"","",null,null,"","",null,null,"","",null,null,"","",null,null,"","",null,null,"",""]
[4,null,null,null,null,"","",null,null,"","",null,null,"","",null,null,"","",null,null,"","",null,null,"","",null,null,"","",null,null,"","",null,null,"","",null,null,"",""]
[3,null,null,null,null,"","",null,null,"","",null,null,"","",null,null,"","",null,null,"","",null,null,"","",null,null,"","",null,null,"","",null,null,"","",null,null,"",""]
[2,null,null,null,null,"","",null,null,"","",null,null,"","",null,null,"","",null,null,"","",null,null,"","",null,null,"","",null,null,"","",null,null,"","",null,null,"",""]
[1,"or Correct",null,null,null,{"$f":"IF(E$33=1,\"X\",IF(E$33=\"c\",\"X\",IF(E$33=\"correct\",\"X\",IF(E$33=\"cor\",\"X\",IF(E$33=\"corr\",\"X\",IF(E$33=\"co\",\"X\",\"\"))))))","v":""},{"$f":"IF(G$33=1,\"X\",IF(G$33=\"c\",\"X\",IF(G$33=\"correct\",\"X\",IF(G$33=\"cor\",\"X\",IF(G$33=\"corr\",\"X\",IF(G$33=\"co\",\"X\",\"\"))))))","v":""},null,null,{"$f":"IF(I$33=1,\"X\",IF(I$33=\"c\",\"X\",IF(I$33=\"correct\",\"X\",IF(I$33=\"cor\",\"X\",IF(I$33=\"corr\",\"X\",IF(I$33=\"co\",\"X\",\"\"))))))","v":""},{"$f":"IF(K$33=1,\"X\",IF(K$33=\"c\",\"X\",IF(K$33=\"correct\",\"X\",IF(K$33=\"cor\",\"X\",IF(K$33=\"corr\",\"X\",IF(K$33=\"co\",\"X\",\"\"))))))","v":""},null,null,{"$f":"IF(M$33=1,\"X\",IF(M$33=\"c\",\"X\",IF(M$33=\"correct\",\"X\",IF(M$33=\"cor\",\"X\",IF(M$33=\"corr\",\"X\",IF(M$33=\"co\",\"X\",\"\"))))))","v":""},{"$f":"IF(O$33=1,\"X\",IF(O$33=\"c\",\"X\",IF(O$33=\"correct\",\"X\",IF(O$33=\"cor\",\"X\",IF(O$33=\"corr\",\"X\",IF(O$33=\"co\",\"X\",\"\"))))))","v":""},null,null,{"$f":"IF(Q$33=1,\"X\",IF(Q$33=\"c\",\"X\",IF(Q$33=\"correct\",\"X\",IF(Q$33=\"cor\",\"X\",IF(Q$33=\"corr\",\"X\",IF(Q$33=\"co\",\"X\",\"\"))))))","v":""},{"$f":"IF(S$33=1,\"X\",IF(S$33=\"c\",\"X\",IF(S$33=\"correct\",\"X\",IF(S$33=\"cor\",\"X\",IF(S$33=\"corr\",\"X\",IF(S$33=\"co\",\"X\",\"\"))))))","v":""},null,null,{"$f":"IF(U$33=1,\"X\",IF(U$33=\"c\",\"X\",IF(U$33=\"correct\",\"X\",IF(U$33=\"cor\",\"X\",IF(U$33=\"corr\",\"X\",IF(U$33=\"co\",\"X\",\"\"))))))","v":""},{"$f":"IF(W$33=1,\"X\",IF(W$33=\"c\",\"X\",IF(W$33=\"correct\",\"X\",IF(W$33=\"cor\",\"X\",IF(W$33=\"corr\",\"X\",IF(W$33=\"co\",\"X\",\"\"))))))","v":""},null,null,{"$f":"IF(Y$33=1,\"X\",IF(Y$33=\"c\",\"X\",IF(Y$33=\"correct\",\"X\",IF(Y$33=\"cor\",\"X\",IF(Y$33=\"corr\",\"X\",IF(Y$33=\"co\",\"X\",\"\"))))))","v":""},{"$f":"IF(AA$33=1,\"X\",IF(AA$33=\"c\",\"X\",IF(AA$33=\"correct\",\"X\",IF(AA$33=\"cor\",\"X\",IF(AA$33=\"corr\",\"X\",IF(AA$33=\"co\",\"X\",\"\"))))))","v":""},null,null,{"$f":"IF(AC$33=1,\"X\",IF(AC$33=\"c\",\"X\",IF(AC$33=\"correct\",\"X\",IF(AC$33=\"cor\",\"X\",IF(AC$33=\"corr\",\"X\",IF(AC$33=\"co\",\"X\",\"\"))))))","v":""},{"$f":"IF(AE$33=1,\"X\",IF(AE$33=\"c\",\"X\",IF(AE$33=\"correct\",\"X\",IF(AE$33=\"cor\",\"X\",IF(AE$33=\"corr\",\"X\",IF(AE$33=\"co\",\"X\",\"\"))))))","v":""},null,null,{"$f":"IF(AG$33=1,\"X\",IF(AG$33=\"c\",\"X\",IF(AG$33=\"correct\",\"X\",IF(AG$33=\"cor\",\"X\",IF(AG$33=\"corr\",\"X\",IF(AG$33=\"co\",\"X\",\"\"))))))","v":""},{"$f":"IF(AI$33=1,\"X\",IF(AI$33=\"c\",\"X\",IF(AI$33=\"correct\",\"X\",IF(AI$33=\"cor\",\"X\",IF(AI$33=\"corr\",\"X\",IF(AI$33=\"co\",\"X\",\"\"))))))","v":""},null,null,{"$f":"IF(AK$33=1,\"X\",IF(AK$33=\"c\",\"X\",IF(AK$33=\"correct\",\"X\",IF(AK$33=\"cor\",\"X\",IF(AK$33=\"corr\",\"X\",IF(AK$33=\"co\",\"X\",\"\"))))))","v":""},{"$f":"IF(AM$33=1,\"X\",IF(AM$33=\"c\",\"X\",IF(AM$33=\"correct\",\"X\",IF(AM$33=\"cor\",\"X\",IF(AM$33=\"corr\",\"X\",IF(AM$33=\"co\",\"X\",\"\"))))))","v":""},null,null,{"$f":"IF(AO$33=1,\"X\",IF(AO$33=\"c\",\"X\",IF(AO$33=\"correct\",\"X\",IF(AO$33=\"cor\",\"X\",IF(AO$33=\"corr\",\"X\",IF(AO$33=\"co\",\"X\",\"\"))))))","v":""},{"$f":"IF(AQ$33=1,\"X\",IF(AQ$33=\"c\",\"X\",IF(AQ$33=\"correct\",\"X\",IF(AQ$33=\"cor\",\"X\",IF(AQ$33=\"corr\",\"X\",IF(AQ$33=\"co\",\"X\",\"\"))))))","v":""}]
[0,"/ min spec",null,null,null,{"$f":"IF(E$33=0,\"X\",\"\")","v":"X"},{"$f":"IF(G$33=0,\"X\",\"\")","v":"X"},null,null,{"$f":"IF(I$33=0,\"X\",\"\")","v":"X"},{"$f":"IF(K$33=0,\"X\",\"\")","v":"X"},null,null,{"$f":"IF(M$33=0,\"X\",\"\")","v":"X"},{"$f":"IF(O$33=0,\"X\",\"\")","v":"X"},null,null,{"$f":"IF(Q$33=0,\"X\",\"\")","v":"X"},{"$f":"IF(S$33=0,\"X\",\"\")","v":"X"},null,null,{"$f":"IF(U$33=0,\"X\",\"\")","v":"X"},{"$f":"IF(W$33=0,\"X\",\"\")","v":"X"},null,null,{"$f":"IF(Y$33=0,\"X\",\"\")","v":"X"},{"$f":"IF(AA$33=0,\"X\",\"\")","v":"X"},null,null,{"$f":"IF(AC$33=0,\"X\",\"\")","v":"X"},{"$f":"IF(AE$33=0,\"X\",\"\")","v":"X"},null,null,{"$f":"IF(AG$33=0,\"X\",\"\")","v":"X"},{"$f":"IF(AI$33=0,\"X\",\"\")","v":"X"},null,null,{"$f":"IF(AK$33=0,\"X\",\"\")","v":"X"},{"$f":"IF(AM$33=0,\"X\",\"\")","v":"X"},null,null,{"$f":"IF(AO$33=0,\"X\",\"\")","v":"X"},{"$f":"IF(AQ$33=0,\"X\",\"\")","v":"X"}]
[" <0","or Incorrect",null,null,null,{"$f":"IF(E$33<0,\"X\",IF(E$33=\"i\",\"X\",IF(E$33=\"incorrect\",\"X\",IF(E$33=\"in\",\"X\",IF(E$33=\"inc\",\"X\",\"\")))))","v":""},{"$f":"IF(G$33<0,\"X\",IF(G$33=\"i\",\"X\",IF(G$33=\"incorrect\",\"X\",IF(G$33=\"in\",\"X\",IF(G$33=\"inc\",\"X\",\"\")))))","v":""},null,null,{"$f":"IF(I$33<0,\"X\",IF(I$33=\"i\",\"X\",IF(I$33=\"incorrect\",\"X\",IF(I$33=\"in\",\"X\",IF(I$33=\"inc\",\"X\",\"\")))))","v":""},{"$f":"IF(K$33<0,\"X\",IF(K$33=\"i\",\"X\",IF(K$33=\"incorrect\",\"X\",IF(K$33=\"in\",\"X\",IF(K$33=\"inc\",\"X\",\"\")))))","v":""},null,null,{"$f":"IF(M$33<0,\"X\",IF(M$33=\"i\",\"X\",IF(M$33=\"incorrect\",\"X\",IF(M$33=\"in\",\"X\",IF(M$33=\"inc\",\"X\",\"\")))))","v":""},{"$f":"IF(O$33<0,\"X\",IF(O$33=\"i\",\"X\",IF(O$33=\"incorrect\",\"X\",IF(O$33=\"in\",\"X\",IF(O$33=\"inc\",\"X\",\"\")))))","v":""},null,null,{"$f":"IF(Q$33<0,\"X\",IF(Q$33=\"i\",\"X\",IF(Q$33=\"incorrect\",\"X\",IF(Q$33=\"in\",\"X\",IF(Q$33=\"inc\",\"X\",\"\")))))","v":""},{"$f":"IF(S$33<0,\"X\",IF(S$33=\"i\",\"X\",IF(S$33=\"incorrect\",\"X\",IF(S$33=\"in\",\"X\",IF(S$33=\"inc\",\"X\",\"\")))))","v":""},null,null,{"$f":"IF(U$33<0,\"X\",IF(U$33=\"i\",\"X\",IF(U$33=\"incorrect\",\"X\",IF(U$33=\"in\",\"X\",IF(U$33=\"inc\",\"X\",\"\")))))","v":""},{"$f":"IF(W$33<0,\"X\",IF(W$33=\"i\",\"X\",IF(W$33=\"incorrect\",\"X\",IF(W$33=\"in\",\"X\",IF(W$33=\"inc\",\"X\",\"\")))))","v":""},null,null,{"$f":"IF(Y$33<0,\"X\",IF(Y$33=\"i\",\"X\",IF(Y$33=\"incorrect\",\"X\",IF(Y$33=\"in\",\"X\",IF(Y$33=\"inc\",\"X\",\"\")))))","v":""},{"$f":"IF(AA$33<0,\"X\",IF(AA$33=\"i\",\"X\",IF(AA$33=\"incorrect\",\"X\",IF(AA$33=\"in\",\"X\",IF(AA$33=\"inc\",\"X\",\"\")))))","v":""},null,null,{"$f":"IF(AC$33<0,\"X\",IF(AC$33=\"i\",\"X\",IF(AC$33=\"incorrect\",\"X\",IF(AC$33=\"in\",\"X\",IF(AC$33=\"inc\",\"X\",\"\")))))","v":""},{"$f":"IF(AE$33<0,\"X\",IF(AE$33=\"i\",\"X\",IF(AE$33=\"incorrect\",\"X\",IF(AE$33=\"in\",\"X\",IF(AE$33=\"inc\",\"X\",\"\")))))","v":""},null,null,{"$f":"IF(AG$33<0,\"X\",IF(AG$33=\"i\",\"X\",IF(AG$33=\"incorrect\",\"X\",IF(AG$33=\"in\",\"X\",IF(AG$33=\"inc\",\"X\",\"\")))))","v":""},{"$f":"IF(AI$33<0,\"X\",IF(AI$33=\"i\",\"X\",IF(AI$33=\"incorrect\",\"X\",IF(AI$33=\"in\",\"X\",IF(AI$33=\"inc\",\"X\",\"\")))))","v":""},null,null,{"$f":"IF(AK$33<0,\"X\",IF(AK$33=\"i\",\"X\",IF(AK$33=\"incorrect\",\"X\",IF(AK$33=\"in\",\"X\",IF(AK$33=\"inc\",\"X\",\"\")))))","v":""},{"$f":"IF(AM$33<0,\"X\",IF(AM$33=\"i\",\"X\",IF(AM$33=\"incorrect\",\"X\",IF(AM$33=\"in\",\"X\",IF(AM$33=\"inc\",\"X\",\"\")))))","v":""},null,null,{"$f":"IF(AO$33<0,\"X\",IF(AO$33=\"i\",\"X\",IF(AO$33=\"incorrect\",\"X\",IF(AO$33=\"in\",\"X\",IF(AO$33=\"inc\",\"X\",\"\")))))","v":""},{"$f":"IF(AQ$33<0,\"X\",IF(AQ$33=\"i\",\"X\",IF(AQ$33=\"incorrect\",\"X\",IF(AQ$33=\"in\",\"X\",IF(AQ$33=\"inc\",\"X\",\"\")))))","v":""}]
["Date:"]
["HOBBS:"]
["OAT:"]
["PA:"]
["Engine:"]
["Torque:"]
["T.O.T / T4"]
["N1/NG:"]
["N2:"]
["EGT:"]
["NR"]
["Margin Difference"]
["Pilot Initials:"]
[]
[null,"Enter \"Margin Difference\" as a positive or negative number or as \"correct\" or \"incorrect\" for Eurocopter aircraft."]
[null,"      (\"c\" may be substituted for \"correct\" and \"i\" may be substituted for \"incorrect\")"]

{"sheet":"HCM-6 Helicopter Info","index":12,"n_rows":46,"n_cols":32,"rows_kept":46,"cut":false,"hidden":false,"merged":[[0,0,0,34],[3,32,3,33],[6,0,6,8],[4,25,5,29],[4,30,5,34],[6,25,7,29],[6,30,7,34],[1,20,1,29],[3,0,3,10],[1,30,1,34],[1,15,1,19],[1,0,1,4],[1,5,1,14],[5,0,5,8],[3,11,3,24],[4,11,4,19],[5,11,5,19],[2,15,2,19],[4,0,4,8],[2,30,2,34],[7,18,7,19],[7,21,7,22],[2,0,2,4],[2,5,2,14],[2,20,2,29],[6,11,6,19],[9,29,9,34],[10,29,10,34],[9,25,9,28],[10,25,10,28],[7,0,7,3],[7,4,7,8],[8,0,8,10],[8,25,8,34],[10,0,10,7],[9,0,9,7],[9,8,9,24],[10,8,10,24],[8,11,8,24],[7,11,7,17],[11,29,11,34],[21,31,21,32],[15,28,15,29],[15,20,15,27],[16,20,16,27],[14,20,14,34],[12,8,12,24],[18,31,18,32],[19,28,19,29],[19,31,19,32],[17,28,17,29],[17,31,17,32],[14,9,14,12],[16,13,16,14],[16,16,16,17],[14,0,14,8],[14,13,14,19],[12,29,12,34],[15,31,15,32],[12,0,12,7],[11,0,11,7],[11,8,11,24],[11,25,11,28],[12,25,12,28],[25,0,25,11],[22,20,22,27],[22,28,22,29],[27,0,27,6],[27,19,27,23],[25,12,25,34],[26,0,26,4],[26,5,26,11],[20,31,20,32],[20,20,20,27],[21,28,21,29],[15,13,15,14],[15,16,15,17],[18,0,23,19],[15,9,15,12],[16,0,16,8],[16,9,16,12],[17,0,17,19],[20,28,20,29],[23,20,23,34],[22,31,22,32],[21,20,21,27],[17,20,17,27],[18,20,18,27],[19,20,19,27],[18,28,18,29],[16,28,16,29],[16,31,16,32],[15,0,15,8],[30,0,30,6],[30,7,30,14],[30,15,30,25],[31,7,31,14],[31,15,31,25],[34,0,34,6],[34,7,34,13],[34,14,34,26],[30,26,30,34],[28,24,28,26],[28,27,28,34],[28,19,28,23],[28,0,28,6],[26,28,26,29],[26,31,26,32],[27,31,27,32],[28,7,28,11],[28,12,28,18],[26,24,26,27],[27,24,27,27],[27,7,27,11],[27,12,27,18],[26,17,26,23],[27,28,27,29],[26,12,26,16],[38,21,38,27],[38,28,38,34],[35,21,35,27],[35,11,35,20],[31,26,31,34],[36,21,36,27],[36,28,36,34],[34,27,34,34],[33,0,33,34],[35,0,35,10],[31,0,31,6],[35,28,35,34],[39,21,39,27],[39,28,39,34],[39,0,39,10],[39,11,39,20],[41,0,41,10],[41,11,41,20],[36,0,36,10],[36,11,36,20],[42,0,42,10],[42,11,42,20],[42,21,42,27],[42,28,42,34],[38,0,38,10],[38,11,38,20],[41,21,41,27],[41,28,41,34],[40,21,40,27],[40,28,40,34],[40,0,40,10],[40,11,40,20],[37,21,37,27],[37,28,37,34],[37,0,37,10],[37,11,37,20],[46,0,49,34],[45,0,45,34],[44,0,44,10],[44,11,44,20],[44,21,44,27],[44,28,44,34],[43,0,43,10],[43,11,43,20],[43,21,43,27],[43,28,43,34]]}
[{"$f":"'Contract Info'!A1:G1","v":"SuperManager v3.23 SEKI"}]
["Date:",null,null,null,null,"Incident/Project Order #:",null,null,null,null,null,null,null,null,null,"Request #:",null,null,null,null,"Make/Model:",null,null,null,null,null,null,null,null,null,"N #:"]
["2022-03-23",null,null,null,null,{"$f":"'Contract Info'!D36","v":0},null,null,null,null,null,null,null,null,null,{"$f":"'Contract Info'!D37","v":0},null,null,null,null,{"$f":"'Contract Info'!D4","v":"Airbus H-125"},null,null,null,null,null,null,null,null,null,{"$f":"'Contract Info'!D3","v":"N836TJ"}]
["Check One:",null,null,null,null,null,null,null,null,null,null,"Check One:"]
["Exclusive-Use Contract",null,null,null,null,null,null,null,null,null,null,"Type 1 Helicopter",null,null,null,null,null,null,null,null,{"$f":"IF('Contract Info'!D5=1,\"x\",\"\")","v":""},null,null,null,null,"Color of A/C:"]
["Call-When-Needed",null,null,null,null,null,null,null,null,null,null,"Type 2 Helicopter",null,null,null,null,null,null,null,null,{"$f":"IF('Contract Info'!D5=2,\"x\",\"\")","v":""}]
["Agency-Owned",null,null,null,null,null,null,null,null,null,null,"Type 3 Helicopter",null,null,null,null,null,null,null,null,{"$f":"IF('Contract Info'!D5=3,\"x\",\"\")","v":"x"},null,null,null,null,"Insured PAX Seats:"]
["Other (List)",null,null,null,null,null,null,null,null,null,null,"Limited/Restricted:",null,null,null,null,null,null,"YES",null,null,"NO"]
[]
["Agency and Home Unit:",null,null,null,null,null,null,null,null,null,null,null,null,null,null,null,null,null,null,null,null,null,null,null,null,"Phone # :"]
["COR Name:",null,null,null,null,null,null,null,{"$f":"'Contract Info'!D14","v":"Marissa Terez"},null,null,null,null,null,null,null,null,null,null,null,null,null,null,null,null,"Phone # :",null,null,null,{"$f":"'Contract Info'!D15","v":"559-565-8888"}]
["CO Name:",null,null,null,null,null,null,null,{"$f":"'Contract Info'!D16","v":"Shavonda Jamison"},null,null,null,null,null,null,null,null,null,null,null,null,null,null,null,null,"Phone # :",null,null,null,{"$f":"'Contract Info'!D17","v":"202-618-7777"}]
["Vendor Name/Contact:",null,null,null,null,null,null,null,{"$f":"'Contract Info'!D8","v":"Butterfly Airways, Inc."},null,null,null,null,null,null,null,null,null,null,null,null,null,null,null,null,"Phone # :",null,null,null,{"$f":"'Contract Info'!D10","v":"928-638-9010"}]
[]
["Type Bucket/Fixed Tank",null,null,null,null,null,null,null,null,"Capacity",null,null,null,"Foam Injection",null,null,null,null,null,null,"Specific Capabilities"]
[null,null,null,null,null,null,null,null,null,null,null,null,null,"YES",null,null,"NO",null,null,null,"Longline/Remote Hook?",null,null,null,null,null,null,null,"YES",null,null,"NO"]
[null,null,null,null,null,null,null,null,null,null,null,null,null,"YES",null,null,"NO",null,null,null,"Carousel?",null,null,null,null,null,null,null,"YES",null,null,"NO"]
["Other Capabilities, Avionics, ETC:",null,null,null,null,null,null,null,null,null,null,null,null,null,null,null,null,null,null,null,"Cargo Letdown?",null,null,null,null,null,null,null,"YES",null,null,"NO"]
[null,null,null,null,null,null,null,null,null,null,null,null,null,null,null,null,null,null,null,null,"Rappel?",null,null,null,null,null,null,null,"YES",null,null,"NO"]
[null,null,null,null,null,null,null,null,null,null,null,null,null,null,null,null,null,null,null,null,"Short-Haul Rescue?",null,null,null,null,null,null,null,"YES",null,null,"NO"]
[null,null,null,null,null,null,null,null,null,null,null,null,null,null,null,null,null,null,null,null,"Internal Litter Capable?",null,null,null,null,null,null,null,"YES",null,null,"NO"]
[null,null,null,null,null,null,null,null,null,null,null,null,null,null,null,null,null,null,null,null,"Aerial Ignition - PSD?",null,null,null,null,null,null,null,"YES",null,null,"NO"]
[null,null,null,null,null,null,null,null,null,null,null,null,null,null,null,null,null,null,null,null,"Aerial Ignition - Helitorch?",null,null,null,null,null,null,null,"YES",null,null,"NO"]
[]
[]
["Vendor Fuel Servicing Vehicle",null,null,null,null,null,null,null,null,null,null,null,"Government Helitender (Crew Chase Truck)"]
["Make/Model:",null,null,null,null,null,null,null,null,null,null,null,"Make/Model:",null,null,null,null,null,null,null,null,null,null,null,"4X4?",null,null,null,"YES",null,null,"NO"]
["License # and State:",null,null,null,null,null,null,null,null,null,null,null,"License # and State:",null,null,null,null,null,null,null,null,null,null,null,"Trailer?",null,null,null,"YES",null,null,"NO"]
["Tank Capacity:",null,null,null,null,null,null,null,null,null,null,null,"Number of Seats:",null,null,null,null,null,null,null,null,null,null,null,"Other:"]
[]
["Hourly Flight Rate:",null,null,null,null,null,null,"Daily Availability Rate:",null,null,null,null,null,null,null,"Daily Flight Hours Guarantee:",null,null,null,null,null,null,null,null,null,null,"# of Vendor Personnel:"]
[{"$f":"'Contract Info'!D18","v":1375},null,null,null,null,null,null,{"$f":"'Contract Info'!D19","v":3095},null,null,null,null,null,null,null,{"$f":"'Contract Info'!D21","v":0}]
[]
["Maintenance and Vendor Crew Information"]
["Current HOBBS:",null,null,null,null,null,null,null,null,null,null,null,null,null,"Next Scheduled Maintenance Due at:"]
["Name & cell #",null,null,null,null,null,null,null,null,null,null,"Position (Pilot/Mechanic/Driver)",null,null,null,null,null,null,null,null,null,"Next Day Off",null,null,null,null,null,null,"Date Relief Due In"]
[]
[]
[]
[]
[]
[]
["Vendor Personnel Lodging Site:",null,null,null,null,null,null,null,null,null,null,null,null,null,null,null,null,null,null,null,null,"Phone Number:"]
["Vendor Personnel Contact Name:",null,null,null,null,null,null,null,null,null,null,null,null,null,null,null,null,null,null,null,null,"Phone Number:"]
["GOV Helicopter Manager Name:",null,null,null,null,null,null,null,null,null,null,null,null,null,null,null,null,null,null,null,null,"Phone Number:"]
["Remarks"]

{"sheet":"HCM-7 Crew Info","index":13,"n_rows":32,"n_cols":42,"rows_kept":32,"cut":false,"hidden":false,"merged":[[3,0,3,13],[3,14,3,29],[3,30,3,40],[3,41,3,46],[5,0,5,6],[5,10,5,46],[0,0,0,38],[0,39,0,46],[1,0,1,16],[1,17,1,29],[1,30,1,40],[1,41,1,46],[6,10,6,46],[7,10,7,46],[9,0,9,7],[9,8,9,11],[9,12,9,15],[9,16,9,20],[9,21,9,24],[9,25,9,28],[9,29,9,39],[9,40,9,46],[10,29,10,39],[10,40,10,46],[11,0,11,7],[11,8,11,11],[11,12,11,15],[11,16,11,20],[11,21,11,24],[11,25,11,28],[11,29,11,39],[11,40,11,46],[10,0,10,7],[10,8,10,11],[10,12,10,15],[10,16,10,20],[10,21,10,24],[10,25,10,28],[12,29,12,39],[12,40,12,46],[13,0,13,7],[13,8,13,11],[13,12,13,15],[13,16,13,20],[13,21,13,24],[13,25,13,28],[13,29,13,39],[13,40,13,46],[12,0,12,7],[12,8,12,11],[12,12,12,15],[12,16,12,20],[12,21,12,24],[12,25,12,28],[14,29,14,39],[14,40,14,46],[15,0,15,7],[15,8,15,11],[15,12,15,15],[15,16,15,20],[15,21,15,24],[15,25,15,28],[15,29,15,39],[15,40,15,46],[14,0,14,7],[14,8,14,11],[14,12,14,15],[14,16,14,20],[14,21,14,24],[14,25,14,28],[16,29,16,39],[16,40,16,46],[17,0,17,7],[17,8,17,11],[17,12,17,15],[17,16,17,20],[17,21,17,24],[17,25,17,28],[17,29,17,39],[17,40,17,46],[16,0,16,7],[16,8,16,11],[16,12,16,15],[16,16,16,20],[16,21,16,24],[16,25,16,28],[18,29,18,39],[18,40,18,46],[19,0,19,7],[19,8,19,11],[19,12,19,15],[19,16,19,20],[19,21,19,24],[19,25,19,28],[19,29,19,39],[19,40,19,46],[18,0,18,7],[18,8,18,11],[18,12,18,15],[18,16,18,20],[18,21,18,24],[18,25,18,28],[20,29,20,39],[20,40,20,46],[21,0,21,7],[21,8,21,11],[21,12,21,15],[21,16,21,20],[21,21,21,24],[21,25,21,28],[21,29,21,39],[21,40,21,46],[20,0,20,7],[20,8,20,11],[20,12,20,15],[20,16,20,20],[20,21,20,24],[20,25,20,28],[22,29,22,39],[22,40,22,46],[23,0,23,7],[23,8,23,11],[23,12,23,15],[23,16,23,20],[23,21,23,24],[23,25,23,28],[23,29,23,39],[23,40,23,46],[22,0,22,7],[22,8,22,11],[22,12,22,15],[22,16,22,20],[22,21,22,24],[22,25,22,28],[24,29,24,39],[24,40,24,46],[25,0,25,7],[25,8,25,11],[25,12,25,15],[25,16,25,20],[25,21,25,24],[25,25,25,28],[25,29,25,39],[25,40,25,46],[24,0,24,7],[24,8,24,11],[24,12,24,15],[24,16,24,20],[24,21,24,24],[24,25,24,28],[26,29,26,39],[26,40,26,46],[27,0,27,7],[27,8,27,11],[27,12,27,15],[27,16,27,20],[27,21,27,24],[27,25,27,28],[27,29,27,39],[27,40,27,46],[26,0,26,7],[26,8,26,11],[26,12,26,15],[26,16,26,20],[26,21,26,24],[26,25,26,28],[28,29,28,39],[28,40,28,46],[29,0,29,7],[29,8,29,11],[29,12,29,15],[29,16,29,20],[29,21,29,24],[29,25,29,28],[29,29,29,39],[29,40,29,46],[28,0,28,7],[28,8,28,11],[28,12,28,15],[28,16,28,20],[28,21,28,24],[28,25,28,28],[30,29,30,39],[30,40,30,46],[31,0,31,7],[31,8,31,11],[31,12,31,15],[31,16,31,20],[31,21,31,24],[31,25,31,28],[31,29,31,39],[31,40,31,46],[30,0,30,7],[30,8,30,11],[30,12,30,15],[30,16,30,20],[30,21,30,24],[30,25,30,28],[32,29,32,39],[32,40,32,46],[33,0,33,7],[33,8,33,11],[33,12,33,15],[33,16,33,20],[33,21,33,24],[33,25,33,28],[33,29,33,39],[33,40,33,46],[32,0,32,7],[32,8,32,11],[32,12,32,15],[32,16,32,20],[32,21,32,24],[32,25,32,28]]}
[{"$f":"'Contract Info'!A1:G1","v":"SuperManager v3.23 SEKI"}]
["AIRCRAFT INCIDENT/PROJECT ORDER # :",null,null,null,null,null,null,null,null,null,null,null,null,null,null,null,null,{"$f":"'Contract Info'!D36","v":0},null,null,null,null,null,null,null,null,null,null,null,null,"AIRCRAFT REQUEST # :",null,null,null,null,null,null,null,null,null,null,{"$f":"'Contract Info'!D37","v":0}]
[]
["CREW NAME or RESOURCE ID # : ",null,null,null,null,null,null,null,null,null,null,null,null,null,null,null,null,null,null,null,null,null,null,null,null,null,null,null,null,null,"DATE FILED:",null,null,null,null,null,null,null,null,null,null,"2022-03-23"]
[]
["TYPE of CREW:",null,null,null,null,null,null,null,null,null,"ATTACHED TO CONTRACT HELICOPTER (Enter Aircraft \"A\" Order/Request and Personnel Subordinate/Roster #"]
[null,null,null,null,null,null,null,null,null,null,"(i.e. A-1.1) in the column next to each individual's name"]
[null,null,null,null,null,null,null,null,null,null,"ATTACHED TO CWN HELICOPTER (Enter Overhead \"O\" Order/Request # in the column next to each Individual's name"]
[]
["Name",null,null,null,null,null,null,null,"Order/        Request #",null,null,null,"Travel Method",null,null,null,"Return to (City)",null,null,null,null,"Last Day Off",null,null,null,"1st Day On Assignment",null,null,null,"Qualifications/Special Skills",null,null,null,null,null,null,null,null,null,null,"Training Needs"]
["Helicopter Manager"]
[]
[]
["Assistant Manager"]
[]
[]
["Lead Crewperson"]
[]
[]
["Crewperson"]
[]
[]
["Crewperson"]
[]
[]
["Crewperson"]
[]
[]
["Crewperson"]
[]
[]
["Crewperson"]

{"sheet":"HCM-16 Contractor Eval","index":14,"n_rows":80,"n_cols":33,"rows_kept":80,"cut":false,"hidden":false,"merged":[[79,0,79,34],[74,0,74,34],[6,0,6,34],[4,31,4,34],[75,0,75,3],[3,19,3,27],[8,0,8,34],[65,0,65,34],[56,1,56,28],[75,4,75,34],[3,6,3,14],[4,4,4,14],[10,0,10,9],[21,1,21,28],[57,0,57,34],[3,0,3,5],[38,26,38,34],[12,0,12,3],[12,4,12,34],[29,0,29,34],[19,0,19,3],[19,4,19,34],[14,1,14,28],[16,0,16,34],[0,0,0,34],[3,31,3,34],[13,0,13,34],[9,0,9,34],[1,0,1,34],[2,0,2,34],[4,17,4,27],[5,0,5,6],[5,7,5,12],[10,26,10,34],[11,0,11,34],[23,0,23,34],[5,27,5,34],[4,0,4,3],[7,1,7,28],[5,24,5,26],[5,13,5,17],[5,18,5,23],[15,0,15,34],[17,0,17,9],[17,26,17,34],[18,0,18,34],[20,0,20,34],[22,0,22,34],[24,0,24,9],[36,0,36,34],[30,0,30,34],[27,0,27,34],[34,0,34,34],[24,26,24,34],[31,0,31,9],[43,0,43,34],[28,1,28,28],[39,0,39,34],[40,0,40,3],[37,0,37,34],[40,4,40,34],[38,0,38,9],[31,26,31,34],[33,0,33,3],[33,4,33,34],[25,0,25,34],[26,0,26,3],[26,4,26,34],[47,0,47,3],[47,4,47,34],[52,0,52,9],[32,0,32,34],[46,0,46,34],[44,0,44,34],[45,0,45,9],[48,0,48,34],[45,26,45,34],[51,0,51,34],[35,1,35,28],[41,0,41,34],[42,1,42,28],[78,0,78,34],[77,0,77,28],[70,1,70,28],[71,0,71,34],[67,0,67,34],[62,0,62,34],[63,1,63,28],[68,4,68,34],[69,0,69,34],[73,26,73,34],[73,0,73,9],[66,0,66,9],[64,0,64,34],[68,0,68,3],[66,26,66,34],[61,0,61,3],[76,0,76,34],[72,0,72,34],[54,4,54,34],[49,1,49,28],[50,0,50,34],[52,26,52,34],[54,0,54,3],[55,0,55,34],[53,0,53,34],[58,0,58,34],[59,0,59,9],[59,26,59,34],[61,4,61,34],[60,0,60,34]]}
[{"$f":"'Contract Info'!A1:G1","v":"SuperManager v3.23 SEKI"}]
["To be completed at the end of your tour."]
["This form is to improve the quality level of Call-When-Needed Helicopter Contracts.  Your remarks will assist us in improving our interagency standards for CWN Helicopter Contracts and Contractors."]
["Contractor's Name:",null,null,null,null,null,{"$f":"'Contract Info'!$D$8","v":"Butterfly Airways, Inc."},null,null,null,null,null,null,null,null,"Contract #:",null,null,null,{"$f":"'Contract Info'!D6","v":"140D8021D0666"},null,null,null,null,null,null,null,null,"A/C N# :",null,null,{"$f":"'Contract Info'!$D$3","v":"N836TJ"}]
["Your Name:",null,null,null,null,null,null,null,null,null,null,null,null,null,null,"E-Mail:",null,null,null,null,null,null,null,null,null,null,null,null,"Agency:",null,null,"DOI-NPS"]
["Your Assignment Date:",null,null,null,null,null,null,null,null,null,null,null,null,"Release Date:",null,null,null,null,null,null,null,null,null,null,"Phone # :"]
[]
[1,"Was the helicopter kept neat and clean?",null,null,null,null,null,null,null,null,null,null,null,null,null,null,null,null,null,null,null,null,null,null,null,null,null,null,null,"Yes","x",null,"No"]
[]
[]
["DOES NOT MEET REQUIREMENTS",null,null,null,null,null,null,null,null,null,null,1,null,null,2,null,null,3,null,null,4,null,null,5,null,null,"EXCEEDS ALL REQUIREMENTS"]
[]
["QUALITY COMMENTS:"]
[]
[2,"Did the fuel truck provide reliable service?",null,null,null,null,null,null,null,null,null,null,null,null,null,null,null,null,null,null,null,null,null,null,null,null,null,null,null,"Yes",null,null,"No"]
[]
[]
["DOES NOT MEET REQUIREMENTS",null,null,null,null,null,null,null,null,null,null,1,null,null,2,null,null,3,null,null,4,null,null,5,null,null,"EXCEEDS ALL REQUIREMENTS"]
[]
["QUALITY COMMENTS:"]
[]
[3,"Did the company keep you fully informed on condition of the crew, helicopter, and fuel truck?",null,null,null,null,null,null,null,null,null,null,null,null,null,null,null,null,null,null,null,null,null,null,null,null,null,null,null,"Yes",null,null,"No"]
[]
[]
["DOES NOT MEET REQUIREMENTS",null,null,null,null,null,null,null,null,null,null,1,null,null,2,null,null,3,null,null,4,null,null,5,null,null,"EXCEEDS ALL REQUIREMENTS"]
[]
["QUALITY COMMENTS:"]
[]
[4,"Did the contractor abide by all provisions of the contract?",null,null,null,null,null,null,null,null,null,null,null,null,null,null,null,null,null,null,null,null,null,null,null,null,null,null,null,"Yes",null,null,"No"]
[]
[]
["DOES NOT MEET REQUIREMENTS",null,null,null,null,null,null,null,null,null,null,1,null,null,2,null,null,3,null,null,4,null,null,5,null,null,"EXCEEDS ALL REQUIREMENTS"]
[]
["COST CONTROL COMMENTS:"]
[]
[5,"Would you take your next assignment with this contractor?",null,null,null,null,null,null,null,null,null,null,null,null,null,null,null,null,null,null,null,null,null,null,null,null,null,null,null,"Yes",null,null,"No"]
[]
[]
["DOES NOT MEET REQUIREMENTS",null,null,null,null,null,null,null,null,null,null,1,null,null,2,null,null,3,null,null,4,null,null,5,null,null,"EXCEEDS ALL REQUIREMENTS"]
[]
["COST CONTROL COMMENTS:"]
[]
[6,"Was the crew and helicopter supported by the company in a timely manner?",null,null,null,null,null,null,null,null,null,null,null,null,null,null,null,null,null,null,null,null,null,null,null,null,null,null,null,"Yes",null,null,"No"]
[]
[]
["DOES NOT MEET REQUIREMENTS",null,null,null,null,null,null,null,null,null,null,1,null,null,2,null,null,3,null,null,4,null,null,5,null,null,"EXCEEDS ALL REQUIREMENTS"]
[]
["TIMELINESS OF PERFORMANCE COMMENTS:"]
[]
[7,"During any mechanical problems, were you informed of the problem and the progress of the work being done to fix the aircraft?                                                                     ",null,null,null,null,null,null,null,null,null,null,null,null,null,null,null,null,null,null,null,null,null,null,null,null,null,null,null,"Yes",null,null,"No"]
[]
[]
["DOES NOT MEET REQUIREMENTS",null,null,null,null,null,null,null,null,null,null,1,null,null,2,null,null,3,null,null,4,null,null,5,null,null,"EXCEEDS ALL REQUIREMENTS"]
[]
["TIMELINESS OF PERFORMANCE COMMENTS:"]
[]
[8,"Did the flight crew/fuel truck/mechanic arrive on time each day?",null,null,null,null,null,null,null,null,null,null,null,null,null,null,null,null,null,null,null,null,null,null,null,null,null,null,null,"Yes",null,null,"No"]
[]
[]
["DOES NOT MEET REQUIREMENTS",null,null,null,null,null,null,null,null,null,null,1,null,null,2,null,null,3,null,null,4,null,null,5,null,null,"EXCEEDS ALL REQUIREMENTS"]
[]
["TIMELINESS OF PERFORMANCE COMMENTS:"]
[]
[9,"Were crew changes handled with little or no confusion, and, was there a briefing between crew members being exchanged?                                                                                                                                   ",null,null,null,null,null,null,null,null,null,null,null,null,null,null,null,null,null,null,null,null,null,null,null,null,null,null,null,"Yes",null,null,"No"]
[]
[]
["DOES NOT MEET REQUIREMENTS",null,null,null,null,null,null,null,null,null,null,1,null,null,2,null,null,3,null,null,4,null,null,5,null,null,"EXCEEDS ALL REQUIREMENTS"]
[]
["BUSINESS RELATIONS COMMENTS:"]
[]
[10,"Were you treated like a preferred customer?",null,null,null,null,null,null,null,null,null,null,null,null,null,null,null,null,null,null,null,null,null,null,null,null,null,null,null,"Yes",null,null,"No"]
[]
[]
["DOES NOT MEET REQUIREMENTS",null,null,null,null,null,null,null,null,null,null,1,null,null,2,null,null,3,null,null,4,null,null,5,null,null,"EXCEEDS ALL REQUIREMENTS"]
[]
["BUSINESS RELATIONS COMMENTS:"]
[]
["Would you like someone to contact you about this contractor?",null,null,null,null,null,null,null,null,null,null,null,null,null,null,null,null,null,null,null,null,null,null,null,null,null,null,null,null,"Yes",null,null,"No"]
[]
["Complete at the end of your assignment and FAX to contracting @ 208-387-5384 or email to jonturner@fs.fed.us"]

{"sheet":"User Manual","index":15,"n_rows":85,"n_cols":26,"rows_kept":85,"cut":false,"hidden":false,"merged":[[47,0,47,1],[47,2,47,44],[47,45,47,46],[48,0,48,1],[48,2,48,44],[48,45,48,46],[49,0,49,1],[49,2,49,44],[49,45,49,46],[44,0,44,1],[44,2,44,44],[44,45,44,46],[45,0,45,1],[45,2,45,44],[45,45,45,46],[46,0,46,1],[46,2,46,44],[46,45,46,46],[40,2,41,44],[41,0,41,1],[41,45,41,46],[42,0,42,1],[42,2,42,44],[42,45,42,46],[43,0,43,1],[43,2,43,44],[43,45,43,46],[40,0,40,1],[40,45,40,46],[34,2,34,7],[34,8,34,11],[34,12,34,15],[34,16,34,24],[34,25,34,35],[34,36,34,46],[35,2,35,7],[35,8,35,11],[35,12,35,15],[35,16,35,24],[35,25,35,35],[35,36,35,46],[32,16,32,24],[32,25,32,35],[32,36,32,46],[33,2,33,7],[33,8,33,11],[33,12,33,15],[33,16,33,24],[33,25,33,35],[33,36,33,46],[21,2,22,44],[23,2,25,44],[23,45,23,46],[24,45,24,46],[25,45,25,46],[26,2,27,44],[26,45,26,46],[28,2,29,44],[31,2,31,44],[29,45,29,46],[27,45,27,46],[26,0,26,1],[25,0,25,1],[27,0,27,1],[28,0,28,1],[29,0,29,1],[13,0,13,1],[14,0,14,1],[19,0,19,1],[23,0,23,1],[24,0,24,1],[21,0,21,1],[38,45,38,46],[35,0,35,1],[39,0,39,1],[39,2,39,44],[39,45,39,46],[36,45,36,46],[37,45,37,46],[34,0,34,1],[30,45,30,46],[31,0,31,1],[31,45,31,46],[38,0,38,1],[38,2,38,44],[32,0,32,1],[33,0,33,1],[36,0,36,1],[36,2,36,44],[37,0,37,1],[37,2,37,44],[30,0,30,1],[30,2,30,44],[32,2,32,7],[32,8,32,11],[32,12,32,15],[0,0,0,46],[20,45,20,46],[13,45,13,46],[14,45,14,46],[15,45,15,46],[16,45,16,46],[17,45,17,46],[18,45,18,46],[28,45,28,46],[11,45,11,46],[12,45,12,46],[21,45,21,46],[22,0,22,1],[12,0,12,1],[22,45,22,46],[9,45,9,46],[10,0,10,1],[9,0,9,1],[15,0,15,1],[16,0,16,1],[17,0,17,1],[18,0,18,1],[20,0,20,1],[10,45,10,46],[19,45,19,46],[12,2,14,44],[15,2,17,44],[18,2,20,44],[6,2,6,44],[1,0,1,46],[2,0,2,46],[7,0,7,1],[7,2,7,44],[7,45,7,46],[8,0,8,1],[8,45,8,46],[8,2,10,44],[11,2,11,44],[11,0,11,1],[3,2,3,44],[5,2,5,44],[4,2,4,44]]}
[{"$f":"'Contract Info'!A1:G1","v":"SuperManager v3.23 SEKI"}]
["User Manual"]
[]
[null,null,"SuperManager is a creation of Glenn Kessler.  SuperManger version 2.4 is freeware."]
[null,null,"You can help improve SuperManager by suggesting changes and telling me about problems. "]
[null,null,"This user manual is unprotected, so you may add notes here.  You can also help by writing a section or subsection  to"]
[null,null,"benefit others as I have not spent time to do so."]
[null,null,"Contact info:              Glenn Kessler      mountainsavvy@gmail.com          503.780.9300"]
[null,null,"Before you begin using SuperManager it is highly recommended that you save a copy of the original workbook and NEVER alter it.  This will enable you to make fresh working copies from original as it is possible to unintentionally delete portions of the SuperManager workbook.   "]
[]
[]
[]
[null,null,"A few key things to ensure are set within Excel to get full functionality when using SuperManager:     \n* Avoid using the browser version of of Excel.  Use the full version of Excel.  More on this below.                           \n* Enable Macros\n* Enable Content\n* SuperManger will work to its full capacity only with macro-enabled Excel (.xlsm).  Without macros working, the butons will not work. The button performs essential functions such as Create Next Day and Print Cost Summary. "]
[]
[]
[null,null,"* Store your copies of SuperManager in a folder that is \"trusted\" folder so the macros work.  Go to File > Options (scroll all the way to the bottom to find \"Options\") >  Trust Center >Trust Center Settings > Trusted Locations > Add new location\n* Ensure your copy of Excel has the menu item Formulas set as follows: Formulas > Calculation Options > Automatic "]
[]
[]
[null,null,"* Save a pristine copy of SuperManager so after you've bungled up your working copy, you can always start afresh.    \n* While SuperManager will work in the browser version, it will not work correctly.  From the browser version, you can get to the Desktop App by clicking on \"Open in Desktop App\" just below the green bar toward the top of the window.                                                                                                                                                                              ."]
[]
[]
[null,null,"Begin using SuperManager by filling in the fields of the Contract Info worksheet. This should be the first worksheet. Almost all other worksheets require information from fields you enter into the Contract Info worksheet."]
[]
[null,null,"SuperManager is intended to be used to manage aircraft on a daily basis.  In order to do this, you will want to enter your first day on the first green-tabbed worksheet (generally named by its date).  From there you may create each subsequent day's worksheet from the previous day's worksheeet using the Create Next Day button."]
[]
[]
[null,null,"It is best to fully complete each day's worksheet prior to creating the next day's worksheet as the end hobbs, end odometer and a good deal of other data is used to \"intelligently\" initialize the next day."]
[]
[null,null,"The background color of the fields in a worksheet denote what type of field it is."]
[]
[]
[null,null,"Field color coding"]
[null,null,null,null,null,null,null,null,null,null,null,null,"no color",null,null,null,"your information",null,null,null,null,null,null,null,null,"enterable"]
[null,null,null,null,null,null,null,null,null,null,null,null,"tan",null,null,null,"calculated fields",null,null,null,null,null,null,null,null,"unenterable"]
[null,null,null,null,null,null,null,null,null,null,null,null,"aqua blue",null,null,null,"form text",null,null,null,null,null,null,null,null,"unenterable"]
[null,null,null,null,null,null,null,null,null,null,null,null,"rose",null,null,null,"signature field",null,null,null,null,null,null,null,null,"unenterable"]
[]
[null,null,"When entering times, always enter in the format nn:nn where n is a number and be sure to INCLUDE THE COLON."]
[null,null,"This is a limitation of MS Excel."]
[]
[null,null,"When you select the Print buton, you will be taken to a preview of the print you are about to make. Depending on the speed of your computer's processor it may take up to 15 seconds for this screen to appear.  Be patient."]
[]
[null,null,"Once the preview appears, if you find it acceptable select \"Print\", otherwise you may cancel the print by"]
[null,null,"selecting \"close\" or hittin the Esc key."]
[]
[null,null,"Writing manuals is not my favorite thing to do, so you write the rest and send it to me and I'll include it in future versions."]
[]
[]
[]
[]
["USER:- Please make additions or changes and add any additional information that will help us stay consistent in gathering all the information needed as HMGBs.  Most of this is based off how Glenn and MORA do things, so I'm fine with modifying it to whatever best meets our needs at SEKI."]
["              Not sure if you'd like to use the Task Order Totals, Contract Grand Totals Details/Overview and Fuel Apportionment Sheets?"]
[]
["Using SuperManager here on my unit:"]
[]
["This program can be used as little or as much as needed.  If utilized to the max, it's essentially a one stop shop for most the documents we use as HMGBs, but it also gives up the ability to pick and chose whatever we want/need. (eg. Use a different cost summary instead of the one built into this program.)  "]
[]
["Naming convention we currently use is Date (DD-Month-YY, Park or Unit Acronym, incident or project leaving out the word Fire, SAR or Project which is specified by color.)  eg. 5-July-22 SEKI Aquatics Amphitheater"]
["At the top of each page list the incident or project for that day or the breakout incident or project for a multi-incident/project day."]
[]
["Tabs should be named and colored consistently. We currently use:  "]
["   * Gray for Preparedness,"]
["   * Purple for ALL (multiple incidents in a day),"]
["   * Red for Fire,"]
["   * Orange for SAR, "]
["   * Green for projects and "]
["   * Yellow for Training. "]
[]
["Account or Agency in the cost summary should generally specify the name of the incident and account to be charged.  "]
[]
["Focus on entering all the information for a multi-incident day on the \"ALL\" page before breaking out the day between incidents/projects. Once the \"ALL\" page is completed then start to break out the day by pressing the \"Copy Sheet\" tab. Repeat this as many times as needed before starting the individual breakouts."]
["When breaking out a multi-incident day into separate worksheets, be sure to adjust the extended standby, wilderness stats, cost summary, personnel costs and any other costs as appropriate for each incident/project break out.  "]
["Add a \"no\" into the \"Non-rev flight?\" category of the flight log if you want to remove that flight leg from the total flight time in the cost summary for the that particular breakout."]
["Add or remove a 1 under the \"Qty\" column and adjust the clock time to change the total hours of pilot/mechanic extended standby for that particular breakout."]
[]
["When creating the next day after a multi-incident day, try and remember to use the \"ALL\" sheet or at least the last sheet of the individual breakouts.  This will ensure that the current Hobbs is transferred and will prevent extra work.  If not, the Hobbs can always be modified on the new sheet."]
[]
["Most of the other information is pretty straight foward and uses/mirrors the standard HMGB forms."]
[]
["Avoid hardcoding dollar or time formulas, but instead use generic formulas that will remain if a correction or modification is made.  This is especially true for the breakouts in multi-incident days."]
["Rather than using \"=\" and selecting the field you want to get the value of, use \"=sum(\" and select the field you want the value of. Then add commas inbetween the fields until you're ready for the total."]
[]
["Avoid copying one field to another field with a different format or size or boarder.  Instead click on the formula bar toward the top of the page and select part or all of the formula bar that you want. "]
["Hit ctrl-c (for copy) and then go to the formula bar of the field to which you want to copy to and hit ctrl-p (for paste)."]
["You can do the same by double clicking on the field you want to copy from and selecting that which you want to copy. Then use ctrl-c for copy. Double click on the field to paste to and use ctrl-p."]